id_mutation,date_mutation,numero_disposition,nature_mutation,valeur_fonciere,adresse_numero,adresse_suffixe,adresse_nom_voie,adresse_code_voie,code_postal,code_commune,nom_commune,code_departement,ancien_code_commune,ancien_nom_commune,id_parcelle,ancien_id_parcelle,numero_volume,lot1_numero,lot1_surface_carrez,lot2_numero,lot2_surface_carrez,lot3_numero,lot3_surface_carrez,lot4_numero,lot4_surface_carrez,lot5_numero,lot5_surface_carrez,nombre_lots,code_type_local,type_local,surface_reelle_bati,nombre_pieces_principales,code_nature_culture,nature_culture,code_nature_culture_speciale,nature_culture_speciale,surface_terrain,longitude,latitude
2020-1250647,2020-03-10,000001,Vente,2000,,,LE PONTREAU,B054,86200,86008,Arçay,86,,,860080000D0052,,,,,,,,,,,,,0,,,,,P,prés,MARAI,Pré marais,3500,-0.008495,46.937369
2020-1250647,2020-03-10,000001,Vente,2000,,,LE PONTREAU,B054,86200,86008,Arçay,86,,,860080000D0057,,,,,,,,,,,,,0,,,,,BT,taillis simples,,,1570,-0.008625,46.937144
2020-1250647,2020-03-10,000001,Vente,2000,,,LE PONTREAU,B054,86200,86008,Arçay,86,,,860080000D0069,,,,,,,,,,,,,0,,,,,S,sols,,,260,-0.007533,46.936601
2020-1252075,2020-06-05,000001,Vente,115000,5,,PL DE L'EGLISE,0260,86200,86008,Arçay,86,,,860080000B0620,,,,,,,,,,,,,0,1,Maison,40,2,S,sols,,,260,0.014166,46.969169
2020-1252075,2020-06-05,000001,Vente,115000,5,,PL DE L'EGLISE,0260,86200,86008,Arçay,86,,,860080000B0620,,,,,,,,,,,,,0,1,Maison,97,3,S,sols,,,260,0.014166,46.969169
2020-1252132,2020-06-05,000001,Vente,8000,,,LE PUITS D ARCAY,B057,86200,86008,Arçay,86,,,860080000A0585,,,,,,,,,,,,,0,,,,,S,sols,,,523,0.007436,46.974117
2020-1252132,2020-06-05,000001,Vente,8000,,,LE PUITS D ARCAY,B057,86200,86008,Arçay,86,,,860080000A0609,,,,,,,,,,,,,0,,,,,S,sols,,,182,0.007509,46.974024
2020-1253659,2020-07-07,000001,Vente,4500,1,,RUE DE LA PUETTE,0480,86200,86008,Arçay,86,,,860080000B0632,,,,,,,,,,,,,0,3,Dépendance,,0,S,sols,,,275,0.01276,46.969915
2020-1253662,2020-07-07,000001,Vente,1500,,,LE BOURG,B008,86200,86008,Arçay,86,,,860080000B0631,,,,,,,,,,,,,0,,,,,S,sols,,,30,0.01285,46.969817
2020-1253736,2020-07-16,000001,Vente,1500,,,FOSSE LANDON,B032,86200,86008,Arçay,86,,,86008000ZD0035,,,,,,,,,,,,,0,,,,,T,terres,,,1510,0.030892,46.954034
2020-1254723,2020-08-14,000001,Vente,69000,,,LES VILLIERS,B065,86200,86008,Arçay,86,,,860080000A0534,,,,,,,,,,,,,0,,,,,J,jardins,,,1077,0.012257,46.972505
2020-1254723,2020-08-14,000001,Vente,69000,,,LES VILLIERS,B065,86200,86008,Arçay,86,,,860080000A0534,,,,,,,,,,,,,0,,,,,S,sols,,,118,0.012257,46.972505
2020-1254723,2020-08-14,000001,Vente,69000,2,,RUE DE LA VOURENTE,0600,86200,86008,Arçay,86,,,860080000A0535,,,,,,,,,,,,,0,1,Maison,77,3,S,sols,,,205,0.012673,46.972649
2020-1254723,2020-08-14,000001,Vente,69000,,,LA GARE,B069,86200,86008,Arçay,86,,,860080000A0669,,,,,,,,,,,,,0,,,,,S,sols,,,20,0.012715,46.972576
2020-1255478,2020-08-11,000001,Vente,7111.75,,,LES MARAIS D ARCAY,B068,86200,86008,Arçay,86,,,860080000C0143,,,,,,,,,,,,,0,,,,,T,terres,,,19315,0.008035,46.939887
2020-1255790,2020-09-18,000001,Vente,34000,,,LES MARAIS D ARCAY,B068,86200,86008,Arçay,86,,,860080000C0134,,,,,,,,,,,,,0,,,,,J,jardins,,,565,0.004803,46.941548
2020-1255790,2020-09-18,000001,Vente,34000,,,VITRE,B066,86200,86008,Arçay,86,,,860080000F0582,,,,,,,,,,,,,0,,,,,BT,taillis simples,,,560,0.009807,46.951027
2020-1255790,2020-09-18,000001,Vente,34000,4,,RTE DE LA GREVE,0340,86200,86008,Arçay,86,,,860080000F0956,,,,,,,,,,,,,0,1,Maison,90,4,S,sols,,,435,-0.001012,46.946386
2020-1255790,2020-09-18,000001,Vente,34000,,,CHASSIGNY,B016,86200,86008,Arçay,86,,,860080000F1005,,,,,,,,,,,,,0,,,,,S,sols,,,109,-0.001013,46.946317
2020-1255796,2020-09-17,000001,Vente,155000,2,,RUE DU POIZOUX,0420,86200,86008,Arçay,86,,,860080000B0768,,,,,,,,,,,,,0,1,Maison,184,8,S,sols,,,880,0.009836,46.969121
2020-1255796,2020-09-17,000001,Vente,155000,,,LE BOURG,B008,86200,86008,Arçay,86,,,860080000B1267,,,,,,,,,,,,,0,,,,,P,prés,,,27,0.009619,46.968867
2020-1255796,2020-09-17,000001,Vente,155000,,,LE BOURG,B008,86200,86008,Arçay,86,,,860080000B1270,,,,,,,,,,,,,0,,,,,P,prés,,,1223,0.009463,46.968776
2020-1256086,2020-09-30,000002,Vente,167,,,LA BARBOTIERE,B003,86200,86008,Arçay,86,,,860080000A0708,,,,,,,,,,,,,0,,,,,J,jardins,,,133,0.005762,46.972483
2020-1256086,2020-09-30,000002,Vente,167,,,LA BARBOTIERE,B003,86200,86008,Arçay,86,,,860080000A0730,,,,,,,,,,,,,0,,,,,T,terres,,,314,0.005524,46.972447
2020-1256086,2020-09-30,000002,Vente,167,,,LA BARBOTIERE,B003,86200,86008,Arçay,86,,,860080000A0733,,,,,,,,,,,,,0,,,,,T,terres,,,132,0.00557,46.972522
2020-1256086,2020-09-30,000002,Vente,167,,,LA BARBOTIERE,B003,86200,86008,Arçay,86,,,860080000A0735,,,,,,,,,,,,,0,,,,,T,terres,,,248,0.005691,46.97261
2020-1256086,2020-09-30,000002,Vente,167,,,LA BARBOTIERE,B003,86200,86008,Arçay,86,,,860080000A0737,,,,,,,,,,,,,0,,,,,J,jardins,,,8,0.005751,46.972713
2020-1256181,2020-10-01,000001,Vente,399000,5186,,RTE DE BRIE,0140,86200,86008,Arçay,86,,,860080000E0102,,,,,,,,,,,,,0,1,Maison,309,6,S,sols,,,2736,-0.004424,46.9431
2020-1256181,2020-10-01,000001,Vente,399000,,,LA BRIANDIERE,B009,86200,86008,Arçay,86,,,860080000E0378,,,,,,,,,,,,,0,,,,,S,sols,,,347,-0.004745,46.943486
2020-1256181,2020-10-01,000001,Vente,399000,,,LA BRIANDIERE,B009,86200,86008,Arçay,86,,,86008000ZE0054,,,,,,,,,,,,,0,,,,,T,terres,,,2844,-0.004227,46.943149
2020-1256611,2020-10-06,000001,Vente,1000,,,LES PRES DU MARAIS,B056,86200,86008,Arçay,86,,,860080000C0123,,,,,,,,,,,,,0,,,,,BT,taillis simples,,,850,0.005705,46.942044
2020-1256611,2020-10-06,000001,Vente,1000,,,LES PRES DU MARAIS,B056,86200,86008,Arçay,86,,,860080000C0124,,,,,,,,,,,,,0,,,,,BT,taillis simples,,,1100,0.005588,46.942276
2020-1256611,2020-10-06,000001,Vente,1000,,,LES PRES DU MARAIS,B056,86200,86008,Arçay,86,,,860080000C0125,,,,,,,,,,,,,0,,,,,BT,taillis simples,,,4410,0.005335,46.94235
2020-1257927,2020-11-18,000001,Vente,38900,3,,RUE DE LA COUTURE,0200,86200,86008,Arçay,86,,,860080000A0582,,,,,,,,,,,,,0,1,Maison,88,3,S,sols,,,740,0.008772,46.973973
2020-1259154,2020-12-16,000001,Vente,200,,,LE BOURG,B008,86200,86008,Arçay,86,,,860080000B1344,,,,,,,,,,,,,0,,,,,T,terres,,,263,0.017316,46.969521
