id_mutation,date_mutation,numero_disposition,nature_mutation,valeur_fonciere,adresse_numero,adresse_suffixe,adresse_nom_voie,adresse_code_voie,code_postal,code_commune,nom_commune,code_departement,ancien_code_commune,ancien_nom_commune,id_parcelle,ancien_id_parcelle,numero_volume,lot1_numero,lot1_surface_carrez,lot2_numero,lot2_surface_carrez,lot3_numero,lot3_surface_carrez,lot4_numero,lot4_surface_carrez,lot5_numero,lot5_surface_carrez,nombre_lots,code_type_local,type_local,surface_reelle_bati,nombre_pieces_principales,code_nature_culture,nature_culture,code_nature_culture_speciale,nature_culture_speciale,surface_terrain,longitude,latitude
2020-1249725,2020-01-21,000001,Vente,390000,,,LES MARGOUILLIS,B218,86460,86152,Mauprévoir,86,,,861520000M0064,,,,,,,,,,,,,0,,,,,P,prés,MARAI,Pré marais,260,0.491641,46.181011
2020-1249725,2020-01-21,000001,Vente,390000,,,TENUE DE CHEZ VILLATTE,B284,86460,86152,Mauprévoir,86,,,861520000M0067,,,,,,,,,,,,,0,,,,,P,prés,MARAI,Pré marais,12865,0.492091,46.181046
2020-1249725,2020-01-21,000001,Vente,390000,,,TENUE DE CHEZ VILLATTE,B284,86460,86152,Mauprévoir,86,,,861520000M0071,,,,,,,,,,,,,0,,,,,T,terres,,,2605,0.495153,46.182144
2020-1249725,2020-01-21,000001,Vente,390000,,,TENUE DE CHEZ VILLATTE,B284,86460,86152,Mauprévoir,86,,,861520000M0072,,,,,,,,,,,,,0,,,,,P,prés,MARAI,Pré marais,3440,0.492913,46.179344
2020-1249725,2020-01-21,000001,Vente,390000,,,TENUE DE CHEZ VILLATTE,B284,86460,86152,Mauprévoir,86,,,861520000M0073,,,,,,,,,,,,,0,,,,,T,terres,,,141022,0.494913,46.179213
2020-1249725,2020-01-21,000001,Vente,390000,,,TENUE DE CHEZ VILLATTE,B284,86460,86152,Mauprévoir,86,,,861520000M0073,,,,,,,,,,,,,0,,,,,T,terres,,,141023,0.494913,46.179213
2020-1249725,2020-01-21,000001,Vente,390000,,,TENUE DE CHEZ VILLATTE,B284,86460,86152,Mauprévoir,86,,,861520000M0074,,,,,,,,,,,,,0,,,,,T,terres,,,50285,0.495459,46.17624
2020-1249725,2020-01-21,000001,Vente,390000,,,PRAIRIE DU PONT DES PARS,B250,86460,86152,Mauprévoir,86,,,861520000M0082,,,,,,,,,,,,,0,,,,,P,prés,,,1555,0.491959,46.178531
2020-1249725,2020-01-21,000001,Vente,390000,,,CHEZ VILLATTE,B117,86460,86152,Mauprévoir,86,,,861520000M0101,,,,,,,,,,,,,0,,,,,T,terres,,,21505,0.499614,46.180953
2020-1249725,2020-01-21,000001,Vente,390000,,,CHEZ VILLATTE,B117,86460,86152,Mauprévoir,86,,,861520000M0102,,,,,,,,,,,,,0,,,,,T,terres,,,4300,0.498693,46.180699
2020-1249725,2020-01-21,000001,Vente,390000,,,CHEZ VILLATTE,B117,86460,86152,Mauprévoir,86,,,861520000M0103,,,,,,,,,,,,,0,,,,,P,prés,,,8480,0.498981,46.179853
2020-1249725,2020-01-21,000001,Vente,390000,5307,,CHEZ VILLATTE,B117,86460,86152,Mauprévoir,86,,,861520000M0104,,,,,,,,,,,,,0,1,Maison,90,2,S,sols,,,1295,0.499176,46.179733
2020-1249725,2020-01-21,000001,Vente,390000,,,CHEZ VILLATTE,B117,86460,86152,Mauprévoir,86,,,861520000M0106,,,,,,,,,,,,,0,,,,,L,landes,,,1265,0.498507,46.179203
2020-1249725,2020-01-21,000001,Vente,390000,,,CHEZ VILLATTE,B117,86460,86152,Mauprévoir,86,,,861520000M0107,,,,,,,,,,,,,0,,,,,P,prés,,,3780,0.497886,46.179188
2020-1249725,2020-01-21,000001,Vente,390000,,,TENUE DE CHEZ VILLATTE,B284,86460,86152,Mauprévoir,86,,,861520000M0179,,,,,,,,,,,,,0,,,,,T,terres,,,2794,0.494338,46.176446
2020-1249725,2020-01-21,000001,Vente,390000,,,PRAIRIE DU PONT DES PARS,B250,86460,86152,Mauprévoir,86,,,861520000M0229,,,,,,,,,,,,,0,,,,,P,prés,,,3420,0.49185,46.176945
2020-1249893,2020-02-11,000001,Vente,44500,,,LE CHEMIN BAS,B099,86460,86152,Mauprévoir,86,,,861520000B0422,,,,,,,,,,,,,0,,,,,P,prés,,,1165,0.518088,46.170607
2020-1249893,2020-02-11,000001,Vente,44500,15,,LE CHEMIN BAS,B099,86460,86152,Mauprévoir,86,,,861520000G0022,,,,,,,,,,,,,0,1,Maison,56,3,S,sols,,,220,0.519193,46.170618
2020-1249893,2020-02-11,000001,Vente,44500,,,LE CHEMIN BAS,B099,86460,86152,Mauprévoir,86,,,861520000G0023,,,,,,,,,,,,,0,,,,,J,jardins,,,1729,0.519594,46.170679
2020-1249893,2020-02-11,000001,Vente,44500,,,LE CHEMIN BAS,B099,86460,86152,Mauprévoir,86,,,861520000G0023,,,,,,,,,,,,,0,,,,,S,sols,,,56,0.519594,46.170679
2020-1250855,2020-03-17,000001,Vente,36000,6,,LE PARADIS,B224,86460,86152,Mauprévoir,86,,,861520000B0202,,,,,,,,,,,,,0,1,Maison,74,3,S,sols,,,80,0.520033,46.176218
2020-1250855,2020-03-17,000001,Vente,36000,,,LE PARADIS,B224,86460,86152,Mauprévoir,86,,,861520000B0203,,,,,,,,,,,,,0,,,,,S,sols,,,115,0.520119,46.17619
2020-1250855,2020-03-17,000001,Vente,36000,,,LE PARADIS,B224,86460,86152,Mauprévoir,86,,,861520000B0205,,,,,,,,,,,,,0,,,,,S,sols,,,20,0.520364,46.176215
2020-1250855,2020-03-17,000001,Vente,36000,,,LE PARADIS,B224,86460,86152,Mauprévoir,86,,,861520000B0209,,,,,,,,,,,,,0,,,,,J,jardins,,,585,,
2020-1250855,2020-03-17,000001,Vente,36000,,,LE PARADIS,B224,86460,86152,Mauprévoir,86,,,861520000B0210,,,,,,,,,,,,,0,,,,,J,jardins,,,610,,
2020-1250855,2020-03-17,000001,Vente,36000,,,LE PARADIS,B224,86460,86152,Mauprévoir,86,,,861520000B0616,,,,,,,,,,,,,0,,,,,S,sols,,,37,0.520398,46.176188
2020-1250855,2020-03-17,000001,Vente,36000,,,LE PARADIS,B224,86460,86152,Mauprévoir,86,,,861520000B0618,,,,,,,,,,,,,0,,,,,S,sols,,,37,0.520331,46.17617
2020-1250855,2020-03-17,000001,Vente,36000,,,LE PARADIS,B224,86460,86152,Mauprévoir,86,,,861520000B0756,,,,,,,,,,,,,0,,,,,T,terres,,,802,0.519754,46.175606
2020-1251113,2020-05-05,000001,Vente,203540,,,LE BOURG,B031,86460,86152,Mauprévoir,86,,,861520000B0389,,,,,,,,,,,,,0,,,,,J,jardins,,,1205,0.520893,46.173725
2020-1251113,2020-05-05,000001,Vente,203540,33,,CHARBON BLANC,B319,86460,86152,Mauprévoir,86,,,861520000B0394,,,,,,,,,,,,,0,1,Maison,239,8,S,sols,,,850,0.520573,46.173576
2020-1251113,2020-05-05,000001,Vente,203540,,,CHARBON BLANC,B319,86460,86152,Mauprévoir,86,,,861520000B0395,,,,,,,,,,,,,0,,,,,J,jardins,,,635,0.520864,46.173492
2020-1251648,2020-06-02,000001,Vente,104000,,,LA GROIE,B194,86460,86152,Mauprévoir,86,,,861520000A0047,,,,,,,,,,,,,0,,,,,J,jardins,,,540,0.501571,46.201353
2020-1251648,2020-06-02,000001,Vente,104000,,,LA GROIE,B194,86460,86152,Mauprévoir,86,,,861520000A0048,,,,,,,,,,,,,0,,,,,T,terres,,,715,0.501686,46.201169
2020-1251648,2020-06-02,000001,Vente,104000,5284,,LA GROIE,B194,86460,86152,Mauprévoir,86,,,861520000A0049,,,,,,,,,,,,,0,1,Maison,78,3,S,sols,,,2295,0.501022,46.201176
2020-1251648,2020-06-02,000001,Vente,104000,,,LA GROIE,B194,86460,86152,Mauprévoir,86,,,861520000A0443,,,,,,,,,,,,,0,,,,,T,terres,,,1600,0.501242,46.201028
2020-1252186,2020-06-05,000001,Vente,,,,LE BOURG,B031,86460,86152,Mauprévoir,86,,,861520000B0390,,,,,,,,,,,,,0,,,,,S,sols,,,285,0.520652,46.17378
2020-1252186,2020-06-05,000001,Vente,,27,,CHARBON BLANC,B319,86460,86152,Mauprévoir,86,,,861520000B0391,,,,,,,,,,,,,0,4,Local industriel. commercial ou assimilé,440,0,S,sols,,,155,0.520505,46.17377
2020-1252688,2020-06-24,000001,Vente,1000,,,LE CHAFFAUD,B062,86460,86152,Mauprévoir,86,,,861520000H0264,,,,,,,,,,,,,0,,,,,S,sols,,,130,0.502123,46.153193
2020-1252688,2020-06-24,000001,Vente,1000,,,LE CHAFFAUD,B062,86460,86152,Mauprévoir,86,,,861520000H0516,,,,,,,,,,,,,0,,,,,S,sols,,,143,0.502073,46.153179
2020-1252977,2020-07-09,000001,Vente,280000,,,LES LISTRES,B212,86460,86152,Mauprévoir,86,,,861520000F0191,,,,,,,,,,,,,0,,,,,L,landes,,,15070,0.536199,46.156782
2020-1252977,2020-07-09,000001,Vente,280000,,,LE GARREAU,B176,86460,86152,Mauprévoir,86,,,861520000F0195,,,,,,,,,,,,,0,,,,,T,terres,,,7200,0.534572,46.158578
2020-1252977,2020-07-09,000001,Vente,280000,,,LE GARREAU,B176,86460,86152,Mauprévoir,86,,,861520000F0196,,,,,,,,,,,,,0,,,,,VI,vignes,,,2545,0.534143,46.158881
2020-1252977,2020-07-09,000001,Vente,280000,,,LE GARREAU,B176,86460,86152,Mauprévoir,86,,,861520000F0197,,,,,,,,,,,,,0,,,,,T,terres,,,4225,0.534002,46.15908
2020-1252977,2020-07-09,000001,Vente,280000,,,LE GARREAU,B176,86460,86152,Mauprévoir,86,,,861520000F0198,,,,,,,,,,,,,0,,,,,T,terres,,,67000,0.533831,46.159295
2020-1252977,2020-07-09,000001,Vente,280000,,,LE GARREAU,B176,86460,86152,Mauprévoir,86,,,861520000F0199,,,,,,,,,,,,,0,,,,,P,prés,,,6240,0.533311,46.157879
2020-1252977,2020-07-09,000001,Vente,280000,,,LE GARREAU,B176,86460,86152,Mauprévoir,86,,,861520000F0200,,,,,,,,,,,,,0,,,,,T,terres,,,27365,0.532955,46.157418
2020-1252977,2020-07-09,000001,Vente,280000,,,LE GARREAU,B176,86460,86152,Mauprévoir,86,,,861520000F0201,,,,,,,,,,,,,0,,,,,T,terres,,,2535,0.531691,46.158565
2020-1252977,2020-07-09,000001,Vente,280000,,,LE GARREAU,B176,86460,86152,Mauprévoir,86,,,861520000F0206,,,,,,,,,,,,,0,,,,,BT,taillis simples,,,24130,0.530383,46.160221
2020-1252977,2020-07-09,000001,Vente,280000,,,LES JARDRONNIERES,B204,86460,86152,Mauprévoir,86,,,861520000F0207,,,,,,,,,,,,,0,,,,,T,terres,,,52070,0.530773,46.161479
2020-1252977,2020-07-09,000001,Vente,280000,,,LES JARDRONNIERES,B204,86460,86152,Mauprévoir,86,,,861520000F0207,,,,,,,,,,,,,0,,,,,T,terres,,,26035,0.530773,46.161479
2020-1252977,2020-07-09,000001,Vente,280000,,,LE GARREAU,B176,86460,86152,Mauprévoir,86,,,861520000F0460,,,,,,,,,,,,,0,,,,,J,jardins,,,1577,0.531239,46.158119
2020-1252977,2020-07-09,000001,Vente,280000,,,LE GARREAU,B176,86460,86152,Mauprévoir,86,,,861520000F0462,,,,,,,,,,,,,0,,,,,S,sols,,,77,0.531156,46.158504
2020-1252977,2020-07-09,000001,Vente,280000,,,LE GARREAU,B176,86460,86152,Mauprévoir,86,,,861520000F0463,,,,,,,,,,,,,0,,,,,S,sols,,,37,0.53123,46.157836
2020-1252977,2020-07-09,000001,Vente,280000,,,LE GARREAU,B176,86460,86152,Mauprévoir,86,,,861520000F0465,,,,,,,,,,,,,0,,,,,T,terres,,,105,0.530815,46.158585
2020-1252977,2020-07-09,000001,Vente,280000,,,LE GARREAU,B176,86460,86152,Mauprévoir,86,,,861520000F0466,,,,,,,,,,,,,0,,,,,T,terres,,,28,0.531112,46.158541
2020-1252977,2020-07-09,000001,Vente,280000,,,LE GARREAU,B176,86460,86152,Mauprévoir,86,,,861520000F0468,,,,,,,,,,,,,0,,,,,P,prés,,,46333,0.532143,46.15997
2020-1252977,2020-07-09,000001,Vente,280000,,,PRES DE LA DURANTIERE,B259,86460,86152,Mauprévoir,86,,,861520000H0080,,,,,,,,,,,,,0,,,,,P,prés,MARAI,Pré marais,27570,0.527597,46.154645
2020-1252977,2020-07-09,000001,Vente,280000,,,PRES DE LA DURANTIERE,B259,86460,86152,Mauprévoir,86,,,861520000H0081,,,,,,,,,,,,,0,,,,,P,prés,MARAI,Pré marais,5185,0.526491,46.155154
2020-1252977,2020-07-09,000001,Vente,280000,,,PRES DE LA DURANTIERE,B259,86460,86152,Mauprévoir,86,,,861520000H0082,,,,,,,,,,,,,0,,,,,L,landes,,,17630,0.527074,46.154236
2020-1252977,2020-07-09,000001,Vente,280000,,,BRANDES DU GARREAU,B050,86460,86152,Mauprévoir,86,,,861520000H0318,,,,,,,,,,,,,0,,,,,T,terres,,,30470,0.531135,46.156446
2020-1252977,2020-07-09,000001,Vente,280000,,,BRANDES DU GARREAU,B050,86460,86152,Mauprévoir,86,,,861520000H0319,,,,,,,,,,,,,0,,,,,T,terres,,,32575,0.532174,46.155785
2020-1252977,2020-07-09,000001,Vente,280000,,,BRANDES DU GARREAU,B050,86460,86152,Mauprévoir,86,,,861520000H0320,,,,,,,,,,,,,0,,,,,T,terres,,,25770,0.53202,46.154375
2020-1252977,2020-07-09,000001,Vente,280000,,,BRANDES DU GARREAU,B050,86460,86152,Mauprévoir,86,,,861520000H0322,,,,,,,,,,,,,0,,,,,L,landes,,,46810,0.534381,46.153469
2020-1252977,2020-07-09,000001,Vente,280000,,,BRANDES DU GARREAU,B050,86460,86152,Mauprévoir,86,,,861520000H0323,,,,,,,,,,,,,0,,,,,T,terres,,,16935,0.534414,46.155854
2020-1252977,2020-07-09,000001,Vente,280000,,,BRANDES DU GARREAU,B050,86460,86152,Mauprévoir,86,,,861520000H0324,,,,,,,,,,,,,0,,,,,T,terres,,,11940,0.535475,46.154203
2020-1252977,2020-07-09,000001,Vente,280000,,,LE GROS CHATAIGNIER,B197,86460,86152,Mauprévoir,86,,,861520000H0330,,,,,,,,,,,,,0,,,,,P,prés,MARAI,Pré marais,6330,0.539906,46.154708
2020-1252977,2020-07-09,000001,Vente,280000,,,LE GROS CHATAIGNIER,B197,86460,86152,Mauprévoir,86,,,861520000H0331,,,,,,,,,,,,,0,,,,,T,terres,,,69990,0.538893,46.155651
2020-1252977,2020-07-09,000001,Vente,280000,,,LE GROS CHATAIGNIER,B197,86460,86152,Mauprévoir,86,,,861520000H0332,,,,,,,,,,,,,0,,,,,L,landes,,,24530,0.540878,46.154869
2020-1252977,2020-07-09,000001,Vente,280000,,,LE GROS CHATAIGNIER,B197,86460,86152,Mauprévoir,86,,,861520000H0474,,,,,,,,,,,,,0,,,,,T,terres,,,900,0.536269,46.156197
2020-1252977,2020-07-09,000001,Vente,280000,,,BRANDES DU GARREAU,B050,86460,86152,Mauprévoir,86,,,861520000H0517,,,,,,,,,,,,,0,,,,,P,prés,,,13107,0.530745,46.157688
2020-1252977,2020-07-09,000001,Vente,280000,,,BRANDES DU GARREAU,B050,86460,86152,Mauprévoir,86,,,861520000H0520,,,,,,,,,,,,,0,,,,,T,terres,,,2390,0.532671,46.157092
2020-1253064,2020-06-25,000001,Vente,12900,,,CHEZ LE BOEUF,B110,86460,86152,Mauprévoir,86,,,861520000B0436,,,,,,,,,,,,,0,,,,,T,terres,,,2379,0.51632,46.168086
2020-1253064,2020-06-25,000001,Vente,12900,,,CHEZ LE BOEUF,B110,86460,86152,Mauprévoir,86,,,861520000B0436,,,,,,,,,,,,,0,,,,,S,sols,,,121,0.51632,46.168086
2020-1253064,2020-06-25,000001,Vente,12900,34,,ALL DE LA PROMENADE,0140,86460,86152,Mauprévoir,86,,,861520000B0661,,,,,,,,,,,,,0,1,Maison,80,3,S,sols,,,165,0.515073,46.16835
2020-1253064,2020-06-25,000001,Vente,12900,34,,ALL DE LA PROMENADE,0140,86460,86152,Mauprévoir,86,,,861520000B0661,,,,,,,,,,,,,0,1,Maison,80,3,J,jardins,,,730,0.515073,46.16835
2020-1253965,2020-08-10,000001,Vente,29000,,,LA ROCHE,B276,86460,86152,Mauprévoir,86,,,861520000B0095,,,,,,,,,,,,,0,,,,,J,jardins,,,660,0.520917,46.177228
2020-1253965,2020-08-10,000001,Vente,29000,,,LA ROCHE,B276,86460,86152,Mauprévoir,86,,,861520000B0095,,,,,,,,,,,,,0,,,,,S,sols,,,275,0.520917,46.177228
2020-1253965,2020-08-10,000001,Vente,29000,3,,LA ROCHE,B276,86460,86152,Mauprévoir,86,,,861520000B0599,,,,,,,,,,,,,0,1,Maison,50,3,S,sols,,,258,0.520566,46.17729
2020-1254072,2020-07-31,000001,Vente,50000,5307,,CHEZ VILLATTE,B117,86460,86152,Mauprévoir,86,,,861520000M0104,,,,,,,,,,,,,0,1,Maison,90,2,S,sols,,,1295,0.499176,46.179733
2020-1254072,2020-07-31,000001,Vente,50000,,,CHEZ VILLATTE,B117,86460,86152,Mauprévoir,86,,,861520000M0106,,,,,,,,,,,,,0,,,,,L,landes,,,1265,0.498507,46.179203
2020-1254198,2020-08-10,000001,Vente,85000,12,,RUDE PAILLE,B280,86460,86152,Mauprévoir,86,,,861520000B0152,,,,,,,,,,,,,0,1,Maison,49,3,S,sols,,,305,0.515517,46.176587
2020-1254198,2020-08-10,000001,Vente,85000,,,RUDE PAILLE,B280,86460,86152,Mauprévoir,86,,,861520000B0642,,,,,,,,,,,,,0,,,,,J,jardins,,,888,0.515604,46.176513
2020-1254493,2020-08-28,000001,Vente,30500,31,,CHARBON BLANC,B319,86460,86152,Mauprévoir,86,,,861520000B0393,,,,,,,,,,,,,0,1,Maison,52,2,S,sols,,,55,0.520405,46.173683
2020-1255907,2020-10-09,000001,Vente,60000,5400,,LA DURANTIERE,B142,86460,86152,Mauprévoir,86,,,861520000G0437,,,,,,,,,,,,,0,1,Maison,75,4,S,sols,,,947,0.52649,46.167746
2020-1255907,2020-10-09,000001,Vente,60000,,,LA DURANTIERE,B142,86460,86152,Mauprévoir,86,,,861520000G0443,,,,,,,,,,,,,0,,,,,S,sols,,,577,0.526978,46.167817
2020-1255907,2020-10-09,000001,Vente,60000,,,LA DURANTIERE,B142,86460,86152,Mauprévoir,86,,,861520000G0449,,,,,,,,,,,,,0,,,,,J,jardins,,,122,0.527161,46.167831
2020-1256211,2020-10-13,000001,Vente,92500,,,CHARBON BLANC,B319,86460,86152,Mauprévoir,86,,,861520000B0717,,,,,,,,,,,,,0,,,,,T,terres,,,30,0.520279,46.173999
2020-1256211,2020-10-13,000001,Vente,92500,23,,CHARBON BLANC,B319,86460,86152,Mauprévoir,86,,,861520000B0785,,,,,,,,,,,,,0,1,Maison,112,5,S,sols,,,1215,0.520075,46.173886
2020-1256218,2020-10-13,000001,Vente,400,,,LE BOURG,B031,86460,86152,Mauprévoir,86,,,861520000B0349,,,,,,,,,,,,,0,,,,,J,jardins,,,200,0.518943,46.173318
2020-1256660,2020-10-29,000001,Vente,100000,,,LA DURANTIERE,B142,86460,86152,Mauprévoir,86,,,861520000G0070,,,,,,,,,,,,,0,,,,,S,sols,,,71,0.523981,46.169502
2020-1256660,2020-10-29,000001,Vente,100000,,,LA DURANTIERE,B142,86460,86152,Mauprévoir,86,,,861520000G0071,,,,,,,,,,,,,0,,,,,S,sols,,,46,0.523988,46.169484
2020-1256660,2020-10-29,000001,Vente,100000,41,,LA DURANTIERE,B142,86460,86152,Mauprévoir,86,,,861520000G0072,,,,,,,,,,,,,0,1,Maison,120,5,S,sols,,,445,0.523866,46.16963
2020-1256745,2020-10-28,000001,Vente,38000,,,PRES DE LA DURANTIERE,B259,86460,86152,Mauprévoir,86,,,861520000H0087,,,,,,,,,,,,,0,,,,,P,prés,MARAI,Pré marais,2405,0.529936,46.15242
2020-1256745,2020-10-28,000001,Vente,38000,,,PRES DE LA DURANTIERE,B259,86460,86152,Mauprévoir,86,,,861520000H0087,,,,,,,,,,,,,0,,,,,E,eaux,ETANG,Etangs,5000,0.529936,46.15242
2020-1256745,2020-10-28,000001,Vente,38000,,,PRES DE LA DURANTIERE,B259,86460,86152,Mauprévoir,86,,,861520000H0088,,,,,,,,,,,,,0,,,,,P,prés,MARAI,Pré marais,555,0.531293,46.152658
2020-1256745,2020-10-28,000001,Vente,38000,,,PRES DE LA DURANTIERE,B259,86460,86152,Mauprévoir,86,,,861520000H0089,,,,,,,,,,,,,0,,,,,P,prés,MARAI,Pré marais,3300,0.53067,46.152199
2020-1256745,2020-10-28,000001,Vente,38000,,,PRES DE LA DURANTIERE,B259,86460,86152,Mauprévoir,86,,,861520000H0089,,,,,,,,,,,,,0,,,,,E,eaux,ETANG,Etangs,3785,0.53067,46.152199
2020-1256745,2020-10-28,000001,Vente,38000,,,PRES DE LA DURANTIERE,B259,86460,86152,Mauprévoir,86,,,861520000H0090,,,,,,,,,,,,,0,,,,,E,eaux,ETANG,Etangs,2100,0.529287,46.151862
2020-1256745,2020-10-28,000001,Vente,38000,,,PRES DE LA DURANTIERE,B259,86460,86152,Mauprévoir,86,,,861520000H0090,,,,,,,,,,,,,0,,,,,P,prés,MARAI,Pré marais,400,0.529287,46.151862
2020-1256745,2020-10-28,000001,Vente,38000,,,PRES DE LA DURANTIERE,B259,86460,86152,Mauprévoir,86,,,861520000H0091,,,,,,,,,,,,,0,,,,,P,prés,MARAI,Pré marais,1570,0.528737,46.15181
2020-1256745,2020-10-28,000001,Vente,38000,,,PRES DE LA DURANTIERE,B259,86460,86152,Mauprévoir,86,,,861520000H0092,,,,,,,,,,,,,0,,,,,P,prés,MARAI,Pré marais,730,0.528676,46.151505
2020-1256745,2020-10-28,000001,Vente,38000,,,PRES DE LA DURANTIERE,B259,86460,86152,Mauprévoir,86,,,861520000H0093,,,,,,,,,,,,,0,,,,,P,prés,MARAI,Pré marais,1290,0.528224,46.151502
2020-1256745,2020-10-28,000001,Vente,38000,,,PRES DE LA DURANTIERE,B259,86460,86152,Mauprévoir,86,,,861520000H0094,,,,,,,,,,,,,0,,,,,BT,taillis simples,,,1270,0.527877,46.151411
2020-1256745,2020-10-28,000001,Vente,38000,,,PRES DE LA DURANTIERE,B259,86460,86152,Mauprévoir,86,,,861520000H0095,,,,,,,,,,,,,0,,,,,BT,taillis simples,,,420,0.527577,46.151622
2020-1256745,2020-10-28,000001,Vente,38000,,,PRES DE LA DURANTIERE,B259,86460,86152,Mauprévoir,86,,,861520000H0096,,,,,,,,,,,,,0,,,,,P,prés,MARAI,Pré marais,1620,0.527973,46.151806
2020-1256745,2020-10-28,000001,Vente,38000,,,PRES DE LA DURANTIERE,B259,86460,86152,Mauprévoir,86,,,861520000H0097,,,,,,,,,,,,,0,,,,,P,prés,MARAI,Pré marais,3360,0.528659,46.152183
2020-1256745,2020-10-28,000001,Vente,38000,,,PRES DE LA DURANTIERE,B259,86460,86152,Mauprévoir,86,,,861520000H0480,,,,,,,,,,,,,0,,,,,T,terres,,,30,0.528984,46.152643
2020-1256745,2020-10-28,000001,Vente,38000,,,PRES DE LA DURANTIERE,B259,86460,86152,Mauprévoir,86,,,861520000H0482,,,,,,,,,,,,,0,,,,,T,terres,,,970,0.530152,46.152747
2020-1256934,2020-11-05,000001,Vente,8750,,,L ETANG DE BARO,B147,86460,86152,Mauprévoir,86,,,861520000F0318,,,,,,,,,,,,,0,,,,,P,prés,,,11170,0.541236,46.163504
2020-1256934,2020-11-05,000001,Vente,8750,,,L ETANG DE BARO,B147,86460,86152,Mauprévoir,86,,,861520000F0319,,,,,,,,,,,,,0,,,,,P,prés,,,11170,0.542361,46.163854
2020-1256934,2020-11-05,000001,Vente,8750,,,L ETANG DE BARO,B147,86460,86152,Mauprévoir,86,,,861520000F0320,,,,,,,,,,,,,0,,,,,P,prés,,,11170,0.54315,46.163732
2020-1256965,2020-10-30,000001,Vente,72000,,,LA DURANTIERE,B142,86460,86152,Mauprévoir,86,,,861520000G0041,,,,,,,,,,,,,0,,,,,J,jardins,,,285,0.52285,46.170321
2020-1256965,2020-10-30,000001,Vente,72000,,,LA DURANTIERE,B142,86460,86152,Mauprévoir,86,,,861520000G0082,,,,,,,,,,,,,0,,,,,S,sols,,,40,0.523367,46.170039
2020-1256965,2020-10-30,000001,Vente,72000,23,,LA DURANTIERE,B142,86460,86152,Mauprévoir,86,,,861520000G0087,,,,,,,,,,,,,0,1,Maison,64,1,S,sols,,,175,0.523274,46.169862
2020-1259042,2020-12-30,000001,Vente,125000,10,,BEL AIR,B010,86460,86152,Mauprévoir,86,,,861520000F0270,,,,,,,,,,,,,0,1,Maison,104,4,S,sols,,,540,0.524614,46.170292
2020-1259042,2020-12-30,000001,Vente,125000,,,LA DURANTIERE,B142,86460,86152,Mauprévoir,86,,,861520000F0271,,,,,,,,,,,,,0,,,,,S,sols,,,296,0.524874,46.170515
2020-1259042,2020-12-30,000001,Vente,125000,,,LA DURANTIERE,B142,86460,86152,Mauprévoir,86,,,861520000F0271,,,,,,,,,,,,,0,,,,,T,terres,,,664,0.524874,46.170515
2020-1259042,2020-12-30,000001,Vente,125000,,,LA DURANTIERE,B142,86460,86152,Mauprévoir,86,,,861520000F0273,,,,,,,,,,,,,0,,,,,VI,vignes,,,740,0.525171,46.170523
