id_mutation,date_mutation,numero_disposition,nature_mutation,valeur_fonciere,adresse_numero,adresse_suffixe,adresse_nom_voie,adresse_code_voie,code_postal,code_commune,nom_commune,code_departement,ancien_code_commune,ancien_nom_commune,id_parcelle,ancien_id_parcelle,numero_volume,lot1_numero,lot1_surface_carrez,lot2_numero,lot2_surface_carrez,lot3_numero,lot3_surface_carrez,lot4_numero,lot4_surface_carrez,lot5_numero,lot5_surface_carrez,nombre_lots,code_type_local,type_local,surface_reelle_bati,nombre_pieces_principales,code_nature_culture,nature_culture,code_nature_culture_speciale,nature_culture_speciale,surface_terrain,longitude,latitude
2020-1251176,2020-05-14,000001,Vente,3000,3,,RUE DE MARSELON,0280,86200,86181,Nueil-sous-Faye,86,,,86181000ZK0105,,,,,,,,,,,,,0,,,,,AG,terrains d'agrément,,,4,0.266992,46.969013
2020-1251176,2020-05-14,000001,Vente,3000,,,MARSELON,B070,86200,86181,Nueil-sous-Faye,86,,,86181000ZK0107,,,,,,,,,,,,,0,,,,,T,terres,,,12355,0.266436,46.968186
2020-1251176,2020-05-14,000001,Vente,3000,,,MARSELON,B070,86200,86181,Nueil-sous-Faye,86,,,86181000ZK0107,,,,,,,,,,,,,0,,,,,S,sols,,,5000,0.266436,46.968186
2020-1251411,2020-05-04,000001,Vente,118000,1,,L ORMEAU CHAUNAIS,B077,86200,86181,Nueil-sous-Faye,86,,,86181000ZE0087,,,,,,,,,,,,,0,1,Maison,130,5,S,sols,,,1328,0.286239,46.97925
2020-1251411,2020-05-04,000001,Vente,118000,,,L ORMEAU CHAUNAIS,B077,86200,86181,Nueil-sous-Faye,86,,,86181000ZE0088,,,,,,,,,,,,,0,,,,,T,terres,,,6120,0.286521,46.979501
2020-1252569,2020-06-30,000001,Vente,85000,2,,RUE DES RUISSEAUX,0420,86200,86181,Nueil-sous-Faye,86,,,86181000AR0133,,,,,,,,,,,,,0,1,Maison,155,6,S,sols,,,1000,0.268675,46.967429
2020-1252569,2020-06-30,000001,Vente,85000,2,,RUE DES RUISSEAUX,0420,86200,86181,Nueil-sous-Faye,86,,,86181000AR0133,,,,,,,,,,,,,0,1,Maison,155,6,J,jardins,,,2160,0.268675,46.967429
2020-1256553,2020-10-27,000001,Vente,55000,5,,VELUE,B117,86200,86181,Nueil-sous-Faye,86,,,86181000AO0008,,,,,,,,,,,,,0,1,Maison,128,4,S,sols,,,4650,0.288684,46.971684
