id_mutation,date_mutation,numero_disposition,nature_mutation,valeur_fonciere,adresse_numero,adresse_suffixe,adresse_nom_voie,adresse_code_voie,code_postal,code_commune,nom_commune,code_departement,ancien_code_commune,ancien_nom_commune,id_parcelle,ancien_id_parcelle,numero_volume,lot1_numero,lot1_surface_carrez,lot2_numero,lot2_surface_carrez,lot3_numero,lot3_surface_carrez,lot4_numero,lot4_surface_carrez,lot5_numero,lot5_surface_carrez,nombre_lots,code_type_local,type_local,surface_reelle_bati,nombre_pieces_principales,code_nature_culture,nature_culture,code_nature_culture_speciale,nature_culture_speciale,surface_terrain,longitude,latitude
2020-1249398,2020-01-14,000002,Vente,32500,,,LE BOURG,B019,86350,86189,Payroux,86,,,861890000G0169,,,,,,,,,,,,,0,,,,,T,terres,,,1830,0.481816,46.212567
2020-1249398,2020-01-14,000002,Vente,32500,,,LE BOURG,B019,86350,86189,Payroux,86,,,861890000G0170,,,,,,,,,,,,,0,,,,,T,terres,,,1210,0.481641,46.212853
2020-1249398,2020-01-14,000002,Vente,32500,,,LE BOURG,B019,86350,86189,Payroux,86,,,861890000G0172,,,,,,,,,,,,,0,,,,,J,jardins,,,370,0.482177,46.212762
2020-1249398,2020-01-14,000002,Vente,32500,,,LE BOURG,B019,86350,86189,Payroux,86,,,861890000G0173,,,,,,,,,,,,,0,,,,,J,jardins,,,650,0.481899,46.212922
2020-1249398,2020-01-14,000002,Vente,32500,46,,RUE RENE FUMERON,1100,86350,86189,Payroux,86,,,861890000G0855,,,,,,,,,,,,,0,1,Maison,98,3,S,sols,,,823,0.482328,46.212563
2020-1249743,2020-01-17,000001,Echange,2500,,,LES RECLOUS,B161,86350,86189,Payroux,86,,,861890000A0232,,,,,,,,,,,,,0,,,,,T,terres,,,2160,0.468649,46.244018
2020-1249743,2020-01-17,000001,Echange,2500,,,LES RECLOUS,B161,86350,86189,Payroux,86,,,861890000A0233,,,,,,,,,,,,,0,,,,,T,terres,,,7190,0.469074,46.244471
2020-1249743,2020-01-17,000001,Echange,2500,,,LES RECLOUS,B161,86350,86189,Payroux,86,,,861890000A0234,,,,,,,,,,,,,0,,,,,T,terres,,,3050,0.469496,46.245159
2020-1249743,2020-01-17,000001,Echange,2500,,,LES GRANDS FOSSES,B095,86350,86189,Payroux,86,,,861890000A0265,,,,,,,,,,,,,0,,,,,T,terres,,,17825,0.475407,46.241019
2020-1249743,2020-01-17,000002,Echange,2500,,,LES GRANDS FOSSES,B095,86350,86189,Payroux,86,,,861890000A0265,,,,,,,,,,,,,0,,,,,T,terres,,,17825,0.475407,46.241019
2020-1251249,2020-05-14,000001,Vente,88000,51,,RUE RENE FUMERON,1100,86350,86189,Payroux,86,,,861890000D0201,,,,,,,,,,,,,0,1,Maison,86,5,S,sols,,,605,0.480974,46.209503
2020-1251249,2020-05-14,000001,Vente,88000,51,,RUE RENE FUMERON,1100,86350,86189,Payroux,86,,,861890000D0201,,,,,,,,,,,,,0,1,Maison,86,5,J,jardins,,,2100,0.480974,46.209503
2020-1252412,2020-06-09,000001,Vente,1000,,,CHAMPS DE LA VALLEE,B033,86350,86189,Payroux,86,,,861890000G0255,,,,,,,,,,,,,0,,,,,T,terres,,,3640,0.472918,46.212992
2020-1252412,2020-06-09,000001,Vente,1000,,,LES FLEURETS,B069,86350,86189,Payroux,86,,,861890000G0406,,,,,,,,,,,,,0,,,,,T,terres,,,1370,0.473325,46.212188
2020-1254452,2020-08-11,000001,Vente,5000,,,LES MARLATIERES,B109,86350,86189,Payroux,86,,,861890000B0215,,,,,,,,,,,,,0,,,,,T,terres,,,180,0.476315,46.232664
2020-1254452,2020-08-11,000001,Vente,5000,,,LES MARLATIERES,B109,86350,86189,Payroux,86,,,861890000B0217,,,,,,,,,,,,,0,,,,,S,sols,,,730,0.476597,46.232702
2020-1254452,2020-08-11,000001,Vente,5000,,,LES MARLATIERES,B109,86350,86189,Payroux,86,,,861890000B0218,,,,,,,,,,,,,0,,,,,T,terres,,,1820,,
2020-1255677,2020-10-06,000001,Vente,47500,5073,,LA VALETTE,B182,86350,86189,Payroux,86,,,861890000C0085,,,,,,,,,,,,,0,1,Maison,88,2,S,sols,,,110,0.522254,46.222094
2020-1255677,2020-10-06,000001,Vente,47500,,,LA VALETTE,B182,86350,86189,Payroux,86,,,861890000C0086,,,,,,,,,,,,,0,,,,,S,sols,,,12,0.522286,46.222209
2020-1255677,2020-10-06,000001,Vente,47500,,,LA VALETTE,B182,86350,86189,Payroux,86,,,861890000C0610,,,,,,,,,,,,,0,,,,,J,jardins,,,273,0.522338,46.222159
2020-1255677,2020-10-06,000001,Vente,47500,,,LA VALETTE,B182,86350,86189,Payroux,86,,,861890000C0611,,,,,,,,,,,,,0,,,,,S,sols,,,122,0.522354,46.222044
2020-1256411,2020-10-15,000001,Vente,200000,,,CHEZ DENISON,B048,86350,86189,Payroux,86,,,861890000E0114,,,,,,,,,,,,,0,,,,,P,prés,,,15067,0.468155,46.191732
2020-1256411,2020-10-15,000001,Vente,200000,,,CHEZ DENISON,B048,86350,86189,Payroux,86,,,861890000E0114,,,,,,,,,,,,,0,,,,,S,sols,,,143,0.468155,46.191732
2020-1256411,2020-10-15,000001,Vente,200000,,,CHEZ DENISON,B048,86350,86189,Payroux,86,,,861890000E0115,,,,,,,,,,,,,0,,,,,J,jardins,,,1255,0.467543,46.191493
2020-1256411,2020-10-15,000001,Vente,200000,,,CHEZ DENISON,B048,86350,86189,Payroux,86,,,861890000E0116,,,,,,,,,,,,,0,,,,,S,sols,,,980,0.467313,46.191444
2020-1256411,2020-10-15,000001,Vente,200000,,,CHEZ DENISON,B048,86350,86189,Payroux,86,,,861890000E0117,,,,,,,,,,,,,0,,,,,T,terres,,,24282,0.468737,46.190673
2020-1256411,2020-10-15,000001,Vente,200000,,,CHEZ DENISON,B048,86350,86189,Payroux,86,,,861890000E0117,,,,,,,,,,,,,0,,,,,T,terres,,,24283,0.468737,46.190673
2020-1256411,2020-10-15,000001,Vente,200000,,,CHEZ DENISON,B048,86350,86189,Payroux,86,,,861890000E0118,,,,,,,,,,,,,0,,,,,T,terres,,,15130,0.46658,46.190589
2020-1256411,2020-10-15,000001,Vente,200000,5252,,CHEZ DENISON,B048,86350,86189,Payroux,86,,,861890000E0120,,,,,,,,,,,,,0,1,Maison,125,4,S,sols,,,5960,0.466687,46.191427
2020-1256411,2020-10-15,000001,Vente,200000,,,CHEZ DENISON,B048,86350,86189,Payroux,86,,,861890000E0121,,,,,,,,,,,,,0,,,,,T,terres,,,1160,0.466108,46.191559
2020-1256411,2020-10-15,000001,Vente,200000,,,CHEZ DENISON,B048,86350,86189,Payroux,86,,,861890000E0122,,,,,,,,,,,,,0,,,,,T,terres,,,3400,0.466781,46.191768
2020-1256411,2020-10-15,000001,Vente,200000,,,MONIQUE,B114,86350,86189,Payroux,86,,,861890000E0123,,,,,,,,,,,,,0,,,,,T,terres,,,5030,0.465851,46.191827
2020-1256820,2020-10-29,000001,Vente,134000,,,PIECE DU CHATAIGNIER,B134,86350,86189,Payroux,86,,,861890000F0153,,,,,,,,,,,,,0,,,,,T,terres,,,17350,0.444064,46.184125
2020-1256820,2020-10-29,000001,Vente,134000,,,CHEZ LES LARS,B051,86350,86189,Payroux,86,,,861890000F0167,,,,,,,,,,,,,0,,,,,T,terres,,,1740,0.44898,46.180041
2020-1256820,2020-10-29,000001,Vente,134000,,,CHEZ LES LARS,B051,86350,86189,Payroux,86,,,861890000F0168,,,,,,,,,,,,,0,,,,,T,terres,,,630,0.448838,46.180233
2020-1256820,2020-10-29,000001,Vente,134000,,,CHEZ LES LARS,B051,86350,86189,Payroux,86,,,861890000F0175,,,,,,,,,,,,,0,,,,,T,terres,,,2420,0.45002,46.182532
2020-1256820,2020-10-29,000001,Vente,134000,,,CHEZ LES LARS,B051,86350,86189,Payroux,86,,,861890000F0176,,,,,,,,,,,,,0,,,,,T,terres,,,2420,0.449844,46.182321
2020-1256820,2020-10-29,000001,Vente,134000,,,CHEZ LES LARS,B051,86350,86189,Payroux,86,,,861890000F0185,,,,,,,,,,,,,0,,,,,T,terres,,,4610,0.45122,46.18096
2020-1256820,2020-10-29,000001,Vente,134000,,,CHEZ LES LARS,B051,86350,86189,Payroux,86,,,861890000F0186,,,,,,,,,,,,,0,,,,,T,terres,,,20800,0.45126,46.182187
2020-1256820,2020-10-29,000001,Vente,134000,,,LA FOSSE ROUGE,B082,86350,86189,Payroux,86,,,861890000F0192,,,,,,,,,,,,,0,,,,,T,terres,,,10870,0.448164,46.183539
2020-1256820,2020-10-29,000001,Vente,134000,,,LA FOSSE ROUGE,B082,86350,86189,Payroux,86,,,861890000F0193,,,,,,,,,,,,,0,,,,,T,terres,,,10870,0.447529,46.183352
2020-1256820,2020-10-29,000001,Vente,134000,,,LA FOSSE ROUGE,B082,86350,86189,Payroux,86,,,861890000F0194,,,,,,,,,,,,,0,,,,,T,terres,,,14620,0.44715,46.182772
2020-1256820,2020-10-29,000001,Vente,134000,,,LA FOSSE ROUGE,B082,86350,86189,Payroux,86,,,861890000F0195,,,,,,,,,,,,,0,,,,,T,terres,,,5880,0.44504,46.184475
2020-1256820,2020-10-29,000001,Vente,134000,,,LA FOSSE ROUGE,B082,86350,86189,Payroux,86,,,861890000F0196,,,,,,,,,,,,,0,,,,,T,terres,,,17980,0.444693,46.184922
2020-1256820,2020-10-29,000001,Vente,134000,,,LA FOSSE ROUGE,B082,86350,86189,Payroux,86,,,861890000F0197,,,,,,,,,,,,,0,,,,,T,terres,,,22960,0.445016,46.185413
2020-1256820,2020-10-29,000001,Vente,134000,,,LA FOSSE ROUGE,B082,86350,86189,Payroux,86,,,861890000F0199,,,,,,,,,,,,,0,,,,,T,terres,,,44380,0.446573,46.18582
2020-1256820,2020-10-29,000001,Vente,134000,,,LES COMBES,B058,86350,86189,Payroux,86,,,861890000F0210,,,,,,,,,,,,,0,,,,,T,terres,,,11910,0.451194,46.187682
2020-1256820,2020-10-29,000001,Vente,134000,,,CHEZ LES LARS,B051,86350,86189,Payroux,86,,,861890000F0299,,,,,,,,,,,,,0,,,,,T,terres,,,4230,0.448446,46.181402
2020-1258271,2020-12-01,000001,Vente,188950,1,,ALL DES EGLANTINES,0600,86350,86189,Payroux,86,,,861890000G0144,,,,,,,,,,,,,0,1,Maison,152,4,S,sols,,,2345,0.484358,46.213896
2020-1258271,2020-12-01,000001,Vente,188950,,,LE BOURG,B019,86350,86189,Payroux,86,,,861890000G0145,,,,,,,,,,,,,0,,,,,L,landes,,,800,0.484754,46.213516
