id_mutation,date_mutation,numero_disposition,nature_mutation,valeur_fonciere,adresse_numero,adresse_suffixe,adresse_nom_voie,adresse_code_voie,code_postal,code_commune,nom_commune,code_departement,ancien_code_commune,ancien_nom_commune,id_parcelle,ancien_id_parcelle,numero_volume,lot1_numero,lot1_surface_carrez,lot2_numero,lot2_surface_carrez,lot3_numero,lot3_surface_carrez,lot4_numero,lot4_surface_carrez,lot5_numero,lot5_surface_carrez,nombre_lots,code_type_local,type_local,surface_reelle_bati,nombre_pieces_principales,code_nature_culture,nature_culture,code_nature_culture_speciale,nature_culture_speciale,surface_terrain,longitude,latitude
2020-1250323,2020-02-06,000001,Vente,35000,,,LE BOURG,B070,86200,86227,Saint-Laon,86,,,862270000A0941,,,,,,,,,,,,,0,,,,,J,jardins,,,1085,-0.013939,46.976881
2020-1250323,2020-02-06,000001,Vente,35000,5042,,CHEM DE MARCOUX,0040,86200,86227,Saint-Laon,86,,,862270000A0956,,,,,,,,,,,,,0,1,Maison,30,1,S,sols,,,480,-0.01422,46.977111
2020-1250323,2020-02-06,000001,Vente,35000,5040,,CHEM DE MARCOUX,0040,86200,86227,Saint-Laon,86,,,862270000A0957,,,,,,,,,,,,,0,1,Maison,80,5,S,sols,,,470,-0.014032,46.977179
2020-1250323,2020-02-06,000001,Vente,35000,,,LE BOURG,B070,86200,86227,Saint-Laon,86,,,862270000A0958,,,,,,,,,,,,,0,,,,,S,sols,,,450,-0.014008,46.9773
2020-1250639,2020-03-06,000001,Vente,9500,,,LA MELERIE,B044,86200,86227,Saint-Laon,86,,,86227000ZM0001,,,,,,,,,,,,,0,,,,,T,terres,,,4387,-0.02595,46.984711
2020-1253683,2020-07-06,000001,Echange,1300,,,LA GRANDE PIERRE LEVEE,B028,86200,86227,Saint-Laon,86,,,86227000ZI0089,,,,,,,,,,,,,0,,,,,T,terres,,,2530,-0.026152,46.959519
2020-1253683,2020-07-06,000002,Echange,1300,,,LES APENTAIS,B002,86200,86227,Saint-Laon,86,,,86227000ZI0054,,,,,,,,,,,,,0,,,,,T,terres,,,2770,-0.025589,46.959699
2020-1254382,2020-08-28,000001,Vente,129000,3,,RUE GRANDE RUE,0065,86200,86227,Saint-Laon,86,,,862270000A1336,,,,,,,,,,,,,0,1,Maison,95,4,AG,terrains d'agrément,,,824,-0.018892,46.978713
2020-1254382,2020-08-28,000001,Vente,129000,3,,RUE GRANDE RUE,0065,86200,86227,Saint-Laon,86,,,862270000A1336,,,,,,,,,,,,,0,1,Maison,95,4,S,sols,,,500,-0.018892,46.978713
2020-1254569,2020-08-13,000001,Vente,30000,5019,,RUE DES VARANNES,0070,86200,86227,Saint-Laon,86,,,862270000A0930,,,,,,,,,,,,,0,1,Maison,48,1,S,sols,,,1830,-0.01532,46.980554
2020-1255245,2020-09-09,000001,Vente,2700,,,LA GREVE,B031,86200,86227,Saint-Laon,86,,,862270000D0354,,,,,,,,,,,,,0,,,,,BT,taillis simples,,,4890,-0.030601,46.953547
2020-1255478,2020-08-11,000001,Vente,7111.75,,,LE GRAND MAULAY,B027,86200,86227,Saint-Laon,86,,,862270000B0264,,,,,,,,,,,,,0,,,,,BT,taillis simples,,,350,0.004674,46.982734
2020-1255478,2020-08-11,000001,Vente,7111.75,,,PIPI,B052,86200,86227,Saint-Laon,86,,,862270000B0359,,,,,,,,,,,,,0,,,,,BT,taillis simples,,,255,0.003368,46.982943
2020-1255478,2020-08-11,000001,Vente,7111.75,,,LA REVALLEE,B059,86200,86227,Saint-Laon,86,,,86227000ZC0145,,,,,,,,,,,,,0,,,,,BT,taillis simples,,,2910,-0.001754,46.979641
2020-1255790,2020-09-18,000001,Vente,34000,,,LA ROCHE A FRION,B062,86200,86227,Saint-Laon,86,,,862270000C0155,,,,,,,,,,,,,0,,,,,BT,taillis simples,,,1110,-0.027136,46.950967
2020-1255790,2020-09-18,000001,Vente,34000,,,LA ROCHE A FRION,B062,86200,86227,Saint-Laon,86,,,862270000C0156,,,,,,,,,,,,,0,,,,,BT,taillis simples,,,1140,-0.026972,46.951054
2020-1255790,2020-09-18,000001,Vente,34000,,,LES GALUCHES DE LA GREVE,B024,86200,86227,Saint-Laon,86,,,86227000ZI0082,,,,,,,,,,,,,0,,,,,BT,taillis simples,,,3213,-0.031035,46.956835
2020-1255931,2020-09-17,000001,Vente,63000,5010,,RUE GRANDE RUE,0065,86200,86227,Saint-Laon,86,,,862270000A0992,,,,,,,,,,,,,0,1,Maison,178,4,S,sols,,,2320,-0.017393,46.977799
2020-1255931,2020-09-17,000001,Vente,63000,,,LE BOURG,B070,86200,86227,Saint-Laon,86,,,862270000A1271,,,,,,,,,,,,,0,,,,,J,jardins,,,472,-0.017604,46.977935
2020-1256009,2020-09-21,000001,Vente,800,,,LA JARDRIE,B032,86200,86227,Saint-Laon,86,,,862270000A1037,,,,,,,,,,,,,0,,,,,T,terres,,,1085,-0.021104,46.977884
2020-1256095,2020-09-28,000001,Vente,82000,5080,,RPT DU 19 MARS 1962,0055,86200,86227,Saint-Laon,86,,,862270000A1320,,,,,,,,,,,,,0,1,Maison,88,4,S,sols,,,592,-0.019712,46.979872
2020-1256095,2020-09-28,000001,Vente,82000,5080,,RPT DU 19 MARS 1962,0055,86200,86227,Saint-Laon,86,,,862270000A1320,,,,,,,,,,,,,0,1,Maison,88,4,J,jardins,,,813,-0.019712,46.979872
