id_mutation,date_mutation,numero_disposition,nature_mutation,valeur_fonciere,adresse_numero,adresse_suffixe,adresse_nom_voie,adresse_code_voie,code_postal,code_commune,nom_commune,code_departement,ancien_code_commune,ancien_nom_commune,id_parcelle,ancien_id_parcelle,numero_volume,lot1_numero,lot1_surface_carrez,lot2_numero,lot2_surface_carrez,lot3_numero,lot3_surface_carrez,lot4_numero,lot4_surface_carrez,lot5_numero,lot5_surface_carrez,nombre_lots,code_type_local,type_local,surface_reelle_bati,nombre_pieces_principales,code_nature_culture,nature_culture,code_nature_culture_speciale,nature_culture_speciale,surface_terrain,longitude,latitude
2020-1249969,2020-02-05,000001,Vente,150,,,SUR LE PRE,B236,86110,86271,Thurageau,86,,,86271000AS0542,,,,,,,,,,,,,0,,,,,BT,taillis simples,,,1605,0.318076,46.768734
2020-1249990,2020-01-27,000001,Vente,70000,8,,RUE DU MAGNOU,0115,86110,86271,Thurageau,86,,,86271000BI0138,,,,,,,,,,,,,0,1,Maison,60,3,S,sols,,,1707,0.245442,46.763275
2020-1250362,2020-02-19,000001,Vente,4500,,,FIEF D ABAIN,B145,86110,86271,Thurageau,86,,,86271000BE0167,,,,,,,,,,,,,0,,,,,T,terres,,,3959,0.218651,46.755057
2020-1250366,2020-02-19,000001,Vente,153000,,,CHAUMONT,B104,86110,86271,Thurageau,86,,,86271000BL0148,,,,,,,,,,,,,0,,,,,T,terres,,,3554,0.235946,46.7742
2020-1250366,2020-02-19,000001,Vente,153000,3,,RTE DES NOYERS,0133,86110,86271,Thurageau,86,,,86271000BL0150,,,,,,,,,,,,,0,1,Maison,70,5,S,sols,,,1040,0.235642,46.774517
2020-1250410,2020-02-28,000001,Vente,20000,,,LES BARRES,B012,86110,86271,Thurageau,86,,,86271000AN0007,,,,,,,,,,,,,0,,,,,P,prés,,,2520,0.288978,46.785388
2020-1250410,2020-02-28,000001,Vente,20000,1,,LES BARRES,B012,86110,86271,Thurageau,86,,,86271000AN0008,,,,,,,,,,,,,0,1,Maison,100,4,S,sols,,,1690,0.289601,46.785573
2020-1250410,2020-02-28,000001,Vente,20000,,,LES BARRES,B012,86110,86271,Thurageau,86,,,86271000AN0009,,,,,,,,,,,,,0,,,,,P,prés,,,1880,0.289637,46.785422
2020-1250945,2020-04-17,000001,Vente,107000,,,LE DEFRE,B132,86110,86271,Thurageau,86,,,86271000AO0233,,,,,,,,,,,,,0,,,,,T,terres,,,5620,0.304479,46.77951
2020-1250945,2020-04-17,000001,Vente,107000,,,LE DEFRE,B132,86110,86271,Thurageau,86,,,86271000AO0235,,,,,,,,,,,,,0,,,,,T,terres,,,2324,0.305033,46.780269
2020-1250945,2020-04-17,000001,Vente,107000,,,LE DEFRE,B132,86110,86271,Thurageau,86,,,86271000AO0239,,,,,,,,,,,,,0,,,,,BT,taillis simples,,,1462,0.304663,46.781088
2020-1250945,2020-04-17,000001,Vente,107000,,,LA GRAND MAISON,B162,86110,86271,Thurageau,86,,,86271000AO0247,,,,,,,,,,,,,0,,,,,T,terres,,,3077,0.303595,46.779821
2020-1250945,2020-04-17,000001,Vente,107000,,,LA GRAND MAISON,B162,86110,86271,Thurageau,86,,,86271000AO0248,,,,,,,,,,,,,0,,,,,T,terres,,,2680,0.303603,46.779525
2020-1250945,2020-04-17,000001,Vente,107000,,,LA GRAND MAISON,B162,86110,86271,Thurageau,86,,,86271000AO0249,,,,,,,,,,,,,0,,,,,T,terres,,,830,0.3036,46.779195
2020-1250945,2020-04-17,000001,Vente,107000,,,LA GRAND MAISON,B162,86110,86271,Thurageau,86,,,86271000AO0250,,,,,,,,,,,,,0,,,,,T,terres,,,842,0.303694,46.778845
2020-1250945,2020-04-17,000001,Vente,107000,,,LA GRAND MAISON,B162,86110,86271,Thurageau,86,,,86271000AO0251,,,,,,,,,,,,,0,,,,,T,terres,,,1709,0.303204,46.7789
2020-1250945,2020-04-17,000001,Vente,107000,,,LA GRAND MAISON,B162,86110,86271,Thurageau,86,,,86271000AO0252,,,,,,,,,,,,,0,,,,,T,terres,,,1780,0.303036,46.778544
2020-1250945,2020-04-17,000001,Vente,107000,8,,LA GRAND MAISON,B162,86110,86271,Thurageau,86,,,86271000AO0261,,,,,,,,,,,,,0,1,Maison,71,3,S,sols,,,1110,0.302376,46.7784
2020-1250945,2020-04-17,000001,Vente,107000,,,LA GRAND MAISON,B162,86110,86271,Thurageau,86,,,86271000AO0341,,,,,,,,,,,,,0,,,,,T,terres,,,525,0.303132,46.778456
2020-1250945,2020-04-17,000001,Vente,107000,,,LA GRAND MAISON,B162,86110,86271,Thurageau,86,,,86271000AO0371,,,,,,,,,,,,,0,,,,,S,sols,,,122,0.302164,46.77853
2020-1251284,2020-05-18,000001,Vente,10000,,,BOIS LE ROY,B302,86110,86271,Thurageau,86,,,86271000AM0060,,,,,,,,,,,,,0,,,,,BT,taillis simples,,,19883,0.281818,46.787158
2020-1251284,2020-05-18,000001,Vente,10000,,,BOIS LE ROY,B302,86110,86271,Thurageau,86,,,86271000AM0063,,,,,,,,,,,,,0,,,,,BR,futaies résineuses,,,15950,0.278614,46.789994
2020-1251554,2020-05-27,000001,Vente,2733.15,,,LE PERCHE,B209,86110,86271,Thurageau,86,,,86271000AP0262,,,,,,,,,,,,,0,,,,,BT,taillis simples,,,3989,0.319407,46.780709
2020-1251554,2020-05-27,000001,Vente,2733.15,,,LE PARC,B203,86110,86271,Thurageau,86,,,86271000AP0263,,,,,,,,,,,,,0,,,,,T,terres,,,3820,0.319445,46.781362
2020-1251568,2020-05-27,000001,Vente,2600,,,LES PRIAS,B258,86110,86271,Thurageau,86,,,86271000AR0278,,,,,,,,,,,,,0,,,,,BT,taillis simples,,,3140,0.333115,46.776579
2020-1251568,2020-05-27,000001,Vente,2600,,,BOIS DE LA GUERLOTERIE,B036,86110,86271,Thurageau,86,,,86271000AR0427,,,,,,,,,,,,,0,,,,,BT,taillis simples,,,656,0.321772,46.77763
2020-1251568,2020-05-27,000001,Vente,2600,,,BOIS DE LA GUERLOTERIE,B036,86110,86271,Thurageau,86,,,86271000AR0432,,,,,,,,,,,,,0,,,,,BT,taillis simples,,,840,0.321345,46.778145
2020-1251568,2020-05-27,000001,Vente,2600,,,BOIS DE LA GUERLOTERIE,B036,86110,86271,Thurageau,86,,,86271000AR0442,,,,,,,,,,,,,0,,,,,BT,taillis simples,,,2307,0.322181,46.779
2020-1251568,2020-05-27,000001,Vente,2600,,,BOIS DE LA GUERLOTERIE,B036,86110,86271,Thurageau,86,,,86271000AR0449,,,,,,,,,,,,,0,,,,,T,terres,,,840,0.322846,46.778413
2020-1251568,2020-05-27,000001,Vente,2600,,,LES VIGNES DE RIGNY,B295,86110,86271,Thurageau,86,,,86271000AS0212,,,,,,,,,,,,,0,,,,,BT,taillis simples,,,1028,0.326941,46.773842
2020-1252131,2020-06-15,000001,Vente,3250,,,LA MORT,B191,86110,86271,Thurageau,86,,,86271000AV0105,,,,,,,,,,,,,0,,,,,T,terres,,,7480,0.292769,46.76703
2020-1252184,2020-06-12,000001,Vente,59782.5,,,LE BOURCANIN,B060,86110,86271,Thurageau,86,,,86271000BH0323,,,,,,,,,,,,,0,,,,,T,terres,,,2765,0.22736,46.762314
2020-1252184,2020-06-12,000001,Vente,59782.5,,,LE BOURCANIN,B060,86110,86271,Thurageau,86,,,86271000BH0333,,,,,,,,,,,,,0,,,,,T,terres,,,10160,0.224515,46.76389
2020-1252184,2020-06-12,000001,Vente,59782.5,,,LE BOURCANIN,B060,86110,86271,Thurageau,86,,,86271000BH0339,,,,,,,,,,,,,0,,,,,T,terres,,,2380,0.222766,46.76395
2020-1252206,2020-05-28,000001,Vente,55000,5,,RUE D ABAIN,0020,86110,86271,Thurageau,86,,,86271000BI0195,,,,,,,,,,,,,0,1,Maison,73,3,S,sols,,,915,,
2020-1252206,2020-05-28,000001,Vente,55000,,,LE BOURG,B062,86110,86271,Thurageau,86,,,86271000BI0342,,,,,,,,,,,,,0,,,,,J,jardins,,,1400,,
2020-1252206,2020-05-28,000001,Vente,55000,,,LE BOURG,B062,86110,86271,Thurageau,86,,,86271000BI0343,,,,,,,,,,,,,0,,,,,J,jardins,,,277,0.242279,46.767416
2020-1252313,2020-06-10,000001,Vente,173000,103,,RTE DE L HERAUDERIE,0088,86110,86271,Thurageau,86,,,86271000AO0127,,,,,,,,,,,,,0,1,Maison,85,2,S,sols,,,531,0.307398,46.78893
2020-1252313,2020-06-10,000001,Vente,173000,103,,RTE DE L HERAUDERIE,0088,86110,86271,Thurageau,86,,,86271000AO0128,,,,,,,,,,,,,0,,,,,S,sols,,,420,0.307551,46.789034
2020-1252313,2020-06-10,000001,Vente,173000,,,LE BOUCHET,B058,86110,86271,Thurageau,86,,,86271000AO0422,,,,,,,,,,,,,0,,,,,J,jardins,,,2544,0.30708,46.788808
2020-1252354,2020-06-17,000001,Vente,93200,12,,LES BOURDES,B061,86110,86271,Thurageau,86,,,86271000AO0083,,,,,,,,,,,,,0,,,,,T,terres,,,1206,,
2020-1252354,2020-06-17,000001,Vente,93200,,,LES BOURDES,B061,86110,86271,Thurageau,86,,,86271000AO0425,,,,,,,,,,,,,0,,,,,S,sols,,,240,0.302554,46.783013
2020-1252354,2020-06-17,000001,Vente,93200,3,,CHE DU BOIS GALANT,0024,86110,86271,Thurageau,86,,,86271000AO0426,,,,,,,,,,,,,0,1,Maison,122,8,S,sols,,,1828,0.302401,46.783128
2020-1252354,2020-06-17,000001,Vente,93200,,,CHE DU BOIS GALANT,0024,86110,86271,Thurageau,86,,,86271000AO0427,,,,,,,,,,,,,0,,,,,S,sols,,,802,0.30202,46.783147
2020-1252354,2020-06-17,000001,Vente,93200,,,CLOSURE DES BOURDES,B116,86110,86271,Thurageau,86,,,86271000AO0428,,,,,,,,,,,,,0,,,,,P,prés,,,3573,0.302835,46.783498
2020-1252585,2020-06-11,000001,Vente,101500,,,LE CLOS DES BOURDES,B114,86110,86271,Thurageau,86,,,86271000AO0048,,,,,,,,,,,,,0,,,,,T,terres,,,6170,0.29786,46.781108
2020-1252585,2020-06-11,000001,Vente,101500,,,LE BOUCHET,B058,86110,86271,Thurageau,86,,,86271000AO0112,,,,,,,,,,,,,0,,,,,T,terres,,,7232,0.303006,46.787927
2020-1252585,2020-06-11,000001,Vente,101500,,,PRES DES FONTAINES,B249,86110,86271,Thurageau,86,,,86271000AO0136,,,,,,,,,,,,,0,,,,,T,terres,,,3723,0.309154,46.786044
2020-1252585,2020-06-11,000001,Vente,101500,,,LE GRAND GUE,B161,86110,86271,Thurageau,86,,,86271000AO0156,,,,,,,,,,,,,0,,,,,T,terres,,,17770,0.306843,46.786441
2020-1252585,2020-06-11,000001,Vente,101500,,,LE GRAND GUE,B161,86110,86271,Thurageau,86,,,86271000AO0157,,,,,,,,,,,,,0,,,,,P,prés,,,2410,0.307049,46.785177
2020-1252585,2020-06-11,000001,Vente,101500,,,LE GRAND GUE,B161,86110,86271,Thurageau,86,,,86271000AO0164,,,,,,,,,,,,,0,,,,,T,terres,,,26000,0.305308,46.786452
2020-1252585,2020-06-11,000001,Vente,101500,,,LE GRAND GUE,B161,86110,86271,Thurageau,86,,,86271000AO0165,,,,,,,,,,,,,0,,,,,T,terres,,,3180,0.305825,46.785043
2020-1252585,2020-06-11,000001,Vente,101500,,,LE DEFRE,B132,86110,86271,Thurageau,86,,,86271000AO0236,,,,,,,,,,,,,0,,,,,T,terres,,,4425,0.305368,46.780461
2020-1252585,2020-06-11,000001,Vente,101500,,,LES TONNELLES,B286,86110,86271,Thurageau,86,,,86271000AP0012,,,,,,,,,,,,,0,,,,,T,terres,,,13970,0.309365,46.777101
2020-1252585,2020-06-11,000001,Vente,101500,,,LE BAS JARDIN,B017,86110,86271,Thurageau,86,,,86271000AP0022,,,,,,,,,,,,,0,,,,,T,terres,,,5415,0.309731,46.777504
2020-1252585,2020-06-11,000001,Vente,101500,,,LES RIVIERES,B268,86110,86271,Thurageau,86,,,86271000AP0027,,,,,,,,,,,,,0,,,,,T,terres,,,3748,0.311858,46.778199
2020-1252585,2020-06-11,000001,Vente,101500,,,PIECE DE BARGE,B215,86110,86271,Thurageau,86,,,86271000AP0068,,,,,,,,,,,,,0,,,,,T,terres,,,9466,0.31439,46.785124
2020-1252585,2020-06-11,000001,Vente,101500,,,PIECE DE BARGE,B215,86110,86271,Thurageau,86,,,86271000AP0070,,,,,,,,,,,,,0,,,,,T,terres,,,5599,0.315434,46.785976
2020-1252585,2020-06-11,000001,Vente,101500,,,PIECE DE BARGE,B215,86110,86271,Thurageau,86,,,86271000AP0071,,,,,,,,,,,,,0,,,,,T,terres,,,1330,0.313941,46.785732
2020-1252585,2020-06-11,000001,Vente,101500,,,PIECE DE BARGE,B215,86110,86271,Thurageau,86,,,86271000AP0072,,,,,,,,,,,,,0,,,,,T,terres,,,10190,0.313535,46.785846
2020-1252585,2020-06-11,000001,Vente,101500,,,LE PRAN,B235,86110,86271,Thurageau,86,,,86271000AP0171,,,,,,,,,,,,,0,,,,,T,terres,,,8660,0.312439,46.777289
2020-1252585,2020-06-11,000001,Vente,101500,,,BOIS DE BARGE,B031,86110,86271,Thurageau,86,,,86271000AR0009,,,,,,,,,,,,,0,,,,,T,terres,,,2470,0.325966,46.786015
2020-1252600,2020-06-25,000001,Vente,378,,,CHAMPS DES GROLLES,B094,86110,86271,Thurageau,86,,,86271000AS0525,,,,,,,,,,,,,0,,,,,BT,taillis simples,,,2222,0.320441,46.767154
2020-1252902,2020-07-01,000001,Vente,4000,5228,,LES BOURDES,B061,86110,86271,Thurageau,86,,,86271000AO0424,,,,,,,,,,,,,0,1,Maison,40,1,S,sols,,,670,0.302758,46.782959
2020-1252918,2020-07-01,000001,Vente,2750,,,LA MOTTE,B193,86110,86271,Thurageau,86,,,86271000AZ0225,,,,,,,,,,,,,0,,,,,T,terres,,,5500,0.262618,46.766851
2020-1252919,2020-07-01,000002,Vente,343.75,,,LA MOTTE,B193,86110,86271,Thurageau,86,,,86271000AZ0225,,,,,,,,,,,,,0,,,,,T,terres,,,5500,0.262618,46.766851
2020-1252962,2020-07-01,000001,Vente,30728,,,LES CHAGNEROTTES,B078,86110,86271,Thurageau,86,,,86271000AZ0087,,,,,,,,,,,,,0,,,,,T,terres,,,3539,0.263194,46.770299
2020-1252962,2020-07-01,000001,Vente,30728,,,SUR LA CORNE DE BOEUF,B119,86110,86271,Thurageau,86,,,86271000BD0030,,,,,,,,,,,,,0,,,,,T,terres,,,1890,0.240402,46.760511
2020-1252962,2020-07-01,000001,Vente,30728,,,BAS DE LA GARAUDIERE,B015,86110,86271,Thurageau,86,,,86271000BD0035,,,,,,,,,,,,,0,,,,,VI,vignes,,,900,0.240666,46.760202
2020-1252962,2020-07-01,000001,Vente,30728,,,LES COSSES DU MAGNOU,B122,86110,86271,Thurageau,86,,,86271000BH0200,,,,,,,,,,,,,0,,,,,T,terres,,,1816,0.242424,46.762999
2020-1252962,2020-07-01,000001,Vente,30728,,,LES COSSES DU MAGNOU,B122,86110,86271,Thurageau,86,,,86271000BH0202,,,,,,,,,,,,,0,,,,,T,terres,,,1938,0.242805,46.763133
2020-1253291,2020-07-22,000001,Vente,25305,,,LES CHEVRIES,B110,86110,86271,Thurageau,86,,,86271000AK0351,,,,,,,,,,,,,0,,,,,T,terres,,,2305,0.24501,46.777746
2020-1253557,2020-07-24,000001,Vente,1000,,,BOIS DE BARGE,B031,86110,86271,Thurageau,86,,,86271000AR0494,,,,,,,,,,,,,0,,,,,T,terres,,,6495,0.323584,46.788251
2020-1253627,2020-07-17,000001,Vente,135000,2,,BOIS NOUVEAU,B049,86110,86271,Thurageau,86,,,86271000AN0141,,,,,,,,,,,,,0,1,Maison,89,4,AG,terrains d'agrément,,,6670,0.288365,46.783358
2020-1253627,2020-07-17,000001,Vente,135000,2,,BOIS NOUVEAU,B049,86110,86271,Thurageau,86,,,86271000AN0141,,,,,,,,,,,,,0,1,Maison,89,4,S,sols,,,800,0.288365,46.783358
2020-1253703,2020-08-03,000001,Vente,180000,9,,RTE D OUZILLY,0134,86110,86271,Thurageau,86,,,86271000AS0607,,,,,,,,,,,,,0,1,Maison,94,4,S,sols,,,841,0.319133,46.773781
2020-1253703,2020-08-03,000001,Vente,180000,,,RIGNY,B303,86110,86271,Thurageau,86,,,86271000AS0611,,,,,,,,,,,,,0,,,,,T,terres,,,659,0.31894,46.773926
2020-1253917,2020-08-12,000001,Vente,500,,,BAS RIGNY,B018,86110,86271,Thurageau,86,,,86271000AS0582,,,,,,,,,,,,,0,,,,,BT,taillis simples,,,2445,0.324289,46.769308
2020-1254756,2020-09-09,000001,Vente,30500,,,LE COUDRAY,B125,86110,86271,Thurageau,86,,,86271000BE0232,,,,,,,,,,,,,0,,,,,T,terres,,,709,0.234597,46.756955
2020-1254756,2020-09-09,000001,Vente,30500,3,,LE COUDRAY,B125,86110,86271,Thurageau,86,,,86271000BE0234,,,,,,,,,,,,,0,1,Maison,40,0,S,sols,,,153,0.234626,46.757054
2020-1254867,2020-08-19,000001,Vente,3938.4,,,LA CROIX DE CHAUMONT,B127,86110,86271,Thurageau,86,,,86271000BL0167,,,,,,,,,,,,,0,,,,,T,terres,,,2686,0.23187,46.772123
2020-1254867,2020-08-19,000001,Vente,3938.4,,,LARRIETTE,B175,86110,86271,Thurageau,86,,,86271000BL0174,,,,,,,,,,,,,0,,,,,T,terres,,,3127,0.23052,46.77053
2020-1254867,2020-08-19,000001,Vente,3938.4,,,LARRIETTE,B175,86110,86271,Thurageau,86,,,86271000BL0175,,,,,,,,,,,,,0,,,,,T,terres,,,2939,0.230931,46.7703
2020-1254904,2020-08-25,000001,Vente,200000,,,PRES DES FONTAINES,B249,86110,86271,Thurageau,86,,,86271000AO0142,,,,,,,,,,,,,0,,,,,L,landes,,,745,0.311509,46.785632
2020-1254904,2020-08-25,000001,Vente,200000,,,PRES DES FONTAINES,B249,86110,86271,Thurageau,86,,,86271000AO0143,,,,,,,,,,,,,0,,,,,BT,taillis simples,,,4360,0.311179,46.785753
2020-1254904,2020-08-25,000001,Vente,200000,,,BOIS GALANT,B047,86110,86271,Thurageau,86,,,86271000AO0177,,,,,,,,,,,,,0,,,,,T,terres,,,7500,0.304461,46.782129
2020-1254904,2020-08-25,000001,Vente,200000,5452,F,BOIS GALANT,B047,86110,86271,Thurageau,86,,,86271000AO0178,,,,,,,,,,,,,0,1,Maison,204,5,S,sols,,,544,0.305536,46.782388
2020-1254904,2020-08-25,000001,Vente,200000,,,LA CRUCHONERIE,B131,86110,86271,Thurageau,86,,,86271000AO0182,,,,,,,,,,,,,0,,,,,T,terres,,,2681,0.306239,46.781917
2020-1254904,2020-08-25,000001,Vente,200000,,,LA CRUCHONERIE,B131,86110,86271,Thurageau,86,,,86271000AO0182,,,,,,,,,,,,,0,,,,,BP,peupleraies,,,3795,0.306239,46.781917
2020-1254904,2020-08-25,000001,Vente,200000,,,LA CRUCHONERIE,B131,86110,86271,Thurageau,86,,,86271000AO0347,,,,,,,,,,,,,0,,,,,BP,peupleraies,,,798,0.305673,46.781927
2020-1254904,2020-08-25,000001,Vente,200000,,,LA CRUCHONERIE,B131,86110,86271,Thurageau,86,,,86271000AO0347,,,,,,,,,,,,,0,,,,,T,terres,,,1631,0.305673,46.781927
2020-1254904,2020-08-25,000001,Vente,200000,,,LA CRUCHONERIE,B131,86110,86271,Thurageau,86,,,86271000AO0349,,,,,,,,,,,,,0,,,,,BP,peupleraies,,,2789,0.306402,46.781154
2020-1254904,2020-08-25,000001,Vente,200000,,,LA CRUCHONERIE,B131,86110,86271,Thurageau,86,,,86271000AO0350,,,,,,,,,,,,,0,,,,,BT,taillis simples,,,2380,0.306047,46.781077
2020-1255575,2020-10-06,000001,Vente,12000,,,BORNAIS DE LA COUR,B055,86110,86271,Thurageau,86,,,86271000BD0280,,,,,,,,,,,,,0,,,,,T,terres,,,20360,0.247346,46.756978
2020-1255737,2020-09-30,000001,Vente,150000,3,,RUE DU PAS SIBARD,0135,86110,86271,Thurageau,86,,,86271000BI0513,,,,,,,,,,,,,0,1,Maison,119,5,S,sols,,,500,0.246289,46.763258
2020-1255737,2020-09-30,000001,Vente,150000,3,,RUE DU PAS SIBARD,0135,86110,86271,Thurageau,86,,,86271000BI0513,,,,,,,,,,,,,0,1,Maison,119,5,AG,terrains d'agrément,,,500,0.246289,46.763258
2020-1255737,2020-09-30,000001,Vente,150000,,,LE MAGNOU,B182,86110,86271,Thurageau,86,,,86271000BI0516,,,,,,,,,,,,,0,,,,,AB,terrains a bâtir,,,692,0.246503,46.762989
2020-1255752,2020-10-05,000001,Vente,75000,5,,BOIS NOUVEAU,B049,86110,86271,Thurageau,86,,,86271000AN0019,,,,,,,,,,,,,0,1,Maison,48,2,S,sols,,,349,0.292664,46.784473
2020-1255752,2020-10-05,000001,Vente,75000,,,BOIS NOUVEAU,B049,86110,86271,Thurageau,86,,,86271000AN0020,,,,,,,,,,,,,0,,,,,S,sols,,,1029,,
2020-1256214,2020-10-05,000001,Vente,145000,,,LE BARILET,B010,86110,86271,Thurageau,86,,,86271000AK0026,,,,,,,,,,,,,0,,,,,T,terres,,,1920,0.246779,46.780632
2020-1256214,2020-10-05,000001,Vente,145000,,,LE BARILET,B010,86110,86271,Thurageau,86,,,86271000AK0042,,,,,,,,,,,,,0,,,,,J,jardins,,,480,0.247931,46.780736
2020-1256214,2020-10-05,000001,Vente,145000,,,LE BARILET,B010,86110,86271,Thurageau,86,,,86271000AK0043,,,,,,,,,,,,,0,,,,,S,sols,,,254,0.247592,46.78061
2020-1256214,2020-10-05,000001,Vente,145000,1,,LE BARILET,B010,86110,86271,Thurageau,86,,,86271000AK0044,,,,,,,,,,,,,0,1,Maison,203,4,S,sols,,,620,0.247756,46.780736
2020-1257420,2020-11-10,000001,Vente,1400,,,FRANDEVACHE,B153,86110,86271,Thurageau,86,,,86271000ZM0019,,,,,,,,,,,,,0,,,,,BP,peupleraies,,,2060,0.240387,46.794286
2020-1257421,2020-11-10,000001,Vente,1800,,,MORFOND,B190,86110,86271,Thurageau,86,,,86271000AH0049,,,,,,,,,,,,,0,,,,,T,terres,,,2182,0.255096,46.792376
2020-1258223,2020-12-01,000002,Vente,50,,,AGRESSAIS,B004,86110,86271,Thurageau,86,,,86271000AI0506,,,,,,,,,,,,,0,,,,,S,sols,,,30,0.253751,46.781936
2020-1258230,2020-12-01,000002,Vente,300,,,AGRESSAIS,B004,86110,86271,Thurageau,86,,,86271000AI0504,,,,,,,,,,,,,0,,,,,J,jardins,,,89,0.25353,46.782159
2020-1259183,2020-12-23,000001,Vente,300,,,AGRESSAIS,B004,86110,86271,Thurageau,86,,,86271000AI0354,,,,,,,,,,,,,0,,,,,J,jardins,,,83,0.253339,46.782177
2020-1259292,2020-12-30,000001,Vente,1570,,,BOIS DE LA BITERIE,B033,86110,86271,Thurageau,86,,,86271000BL0048,,,,,,,,,,,,,0,,,,,BR,futaies résineuses,,,4525,0.227283,46.779237
2020-1259292,2020-12-30,000001,Vente,1570,,,BOIS DE LA BITERIE,B033,86110,86271,Thurageau,86,,,86271000BL0051,,,,,,,,,,,,,0,,,,,BT,taillis simples,,,1248,0.227634,46.778175
2020-1259292,2020-12-30,000001,Vente,1570,,,BOIS DE LA BITERIE,B033,86110,86271,Thurageau,86,,,86271000BL0053,,,,,,,,,,,,,0,,,,,BT,taillis simples,,,598,0.227725,46.778032
2020-1259292,2020-12-30,000001,Vente,1570,,,BOIS DE LA BITERIE,B033,86110,86271,Thurageau,86,,,86271000BL0054,,,,,,,,,,,,,0,,,,,BT,taillis simples,,,3229,0.227991,46.77787
2020-1259292,2020-12-30,000001,Vente,1570,,,BOIS DE LA BITERIE,B033,86110,86271,Thurageau,86,,,86271000BL0059,,,,,,,,,,,,,0,,,,,BR,futaies résineuses,,,6976,0.227109,46.777838
2020-1259299,2020-12-29,000001,Vente,150,,,LE BOURCANIN,B060,86110,86271,Thurageau,86,,,86271000BH0386,,,,,,,,,,,,,0,,,,,L,landes,,,2016,0.22381,46.764831
