id_mutation,date_mutation,numero_disposition,nature_mutation,valeur_fonciere,adresse_numero,adresse_suffixe,adresse_nom_voie,adresse_code_voie,code_postal,code_commune,nom_commune,code_departement,ancien_code_commune,ancien_nom_commune,id_parcelle,ancien_id_parcelle,numero_volume,lot1_numero,lot1_surface_carrez,lot2_numero,lot2_surface_carrez,lot3_numero,lot3_surface_carrez,lot4_numero,lot4_surface_carrez,lot5_numero,lot5_surface_carrez,nombre_lots,code_type_local,type_local,surface_reelle_bati,nombre_pieces_principales,code_nature_culture,nature_culture,code_nature_culture_speciale,nature_culture_speciale,surface_terrain,longitude,latitude
2020-1261690,2020-02-25,000001,Vente,120000,2,,RTE DE SAINT LEGER,0010,87890,87080,Jouac,87,,,87080000AB0153,,,,,,,,,,,,,0,1,Maison,130,3,S,sols,,,333,1.260872,46.352639
2020-1261690,2020-02-25,000001,Vente,120000,5066,,LE BOURG,B013,87890,87080,Jouac,87,,,87080000AB0171,,,,,,,,,,,,,0,4,Local industriel. commercial ou assimilé,22,0,J,jardins,,,517,1.260712,46.352806
2020-1261690,2020-02-25,000001,Vente,120000,5224,,LE BOURG,B013,87890,87080,Jouac,87,,,87080000AB0206,,,,,,,,,,,,,0,3,Dépendance,,0,S,sols,,,130,1.261198,46.352577
2020-1262111,2020-03-19,000001,Vente,35000,,,CHEZ PALANT,B034,87890,87080,Jouac,87,,,870800000A0960,,,,,,,,,,,,,0,,,,,T,terres,,,165,1.283428,46.355443
2020-1262111,2020-03-19,000001,Vente,35000,,,CHEZ PALANT,B034,87890,87080,Jouac,87,,,870800000A0965,,,,,,,,,,,,,0,,,,,T,terres,,,280,1.283135,46.354986
2020-1262111,2020-03-19,000001,Vente,35000,,,CHEZ PALANT,B034,87890,87080,Jouac,87,,,870800000A0980,,,,,,,,,,,,,0,,,,,T,terres,,,200,1.283008,46.355438
2020-1262111,2020-03-19,000001,Vente,35000,,,CHEZ PALANT,B034,87890,87080,Jouac,87,,,870800000A0981,,,,,,,,,,,,,0,,,,,T,terres,,,100,1.283082,46.355486
2020-1262111,2020-03-19,000001,Vente,35000,,,LA CHATAIGNERAIE,B028,87890,87080,Jouac,87,,,87080000AC0130,,,,,,,,,,,,,0,,,,,BT,taillis simples,,,8778,1.259134,46.332699
2020-1262111,2020-03-19,000001,Vente,35000,,,LA CHATAIGNERAIE,B028,87890,87080,Jouac,87,,,87080000AC0172,,,,,,,,,,,,,0,,,,,BT,taillis simples,,,8779,1.259294,46.331085
2020-1263026,2020-05-15,000001,Vente,30000,,,CHEZ PALANT,B034,87890,87080,Jouac,87,,,870800000A0955,,,,,,,,,,,,,0,,,,,T,terres,,,880,1.283838,46.355956
2020-1263026,2020-05-15,000001,Vente,30000,,,CHEZ PALANT,B034,87890,87080,Jouac,87,,,870800000A0956,,,,,,,,,,,,,0,,,,,T,terres,,,350,1.283736,46.355694
2020-1263026,2020-05-15,000001,Vente,30000,,,LES COTES,B043,87890,87080,Jouac,87,,,870800000A1044,,,,,,,,,,,,,0,,,,,BT,taillis simples,,,810,1.276975,46.354295
2020-1263026,2020-05-15,000001,Vente,30000,,,GUE CHAMBOLLET,B080,87890,87080,Jouac,87,,,870800000B0445,,,,,,,,,,,,,0,,,,,BT,taillis simples,,,1904,1.263902,46.341437
2020-1268384,2020-11-14,000001,Vente,25000,14,,MENUSSAC,B092,87890,87080,Jouac,87,,,870800000B0764,,,,,,,,,,,,,0,1,Maison,96,3,S,sols,,,1219,1.265568,46.336725
2020-1268425,2020-11-26,000001,Vente,135000,4,,RTE DE SAINT LEGER,0010,87890,87080,Jouac,87,,,87080000AB0149,,,,,,,,,,,,,0,1,Maison,138,6,S,sols,,,215,1.260965,46.352568
2020-1268425,2020-11-26,000001,Vente,135000,,,LE BOURG,B013,87890,87080,Jouac,87,,,87080000AB0150,,,,,,,,,,,,,0,,,,,J,jardins,,,144,1.260786,46.352459
2020-1268425,2020-11-26,000001,Vente,135000,,,LE BOURG,B013,87890,87080,Jouac,87,,,87080000AB0151,,,,,,,,,,,,,0,,,,,J,jardins,,,133,1.260652,46.352379
2020-1268425,2020-11-26,000001,Vente,135000,,,LE BOURG,B013,87890,87080,Jouac,87,,,87080000AB0152,,,,,,,,,,,,,0,,,,,J,jardins,,,182,1.26058,46.352466
2020-1268425,2020-11-26,000001,Vente,135000,,,LE BOURG,B013,87890,87080,Jouac,87,,,87080000AB0155,,,,,,,,,,,,,0,,,,,J,jardins,,,138,1.260503,46.352563
2020-1268425,2020-11-26,000001,Vente,135000,,,LE BOURG,B013,87890,87080,Jouac,87,,,87080000AB0158,,,,,,,,,,,,,0,,,,,J,jardins,,,148,1.259744,46.352331
2020-1268425,2020-11-26,000001,Vente,135000,5054,,LE BOURG,B013,87890,87080,Jouac,87,,,87080000AB0205,,,,,,,,,,,,,0,3,Dépendance,,0,S,sols,,,55,1.261279,46.352561
2020-1269098,2020-12-28,000001,Vente,9000,,,LA CROIX DU BOIS,B047,87890,87080,Jouac,87,,,870800000A0611,,,,,,,,,,,,,0,,,,,T,terres,,,918,1.268573,46.363364
2020-1269098,2020-12-28,000001,Vente,9000,,,LA CROIX DU BOIS,B047,87890,87080,Jouac,87,,,870800000A0624,,,,,,,,,,,,,0,,,,,T,terres,,,8010,1.269199,46.362495
2020-1269098,2020-12-28,000001,Vente,9000,,,LES BATIDES NORD,B003,87890,87080,Jouac,87,,,870800000A0626,,,,,,,,,,,,,0,,,,,S,sols,,,295,1.267355,46.362431
2020-1269098,2020-12-28,000001,Vente,9000,2,,LES BASTIDES,B142,87890,87080,Jouac,87,,,870800000A0637,,,,,,,,,,,,,0,1,Maison,59,2,S,sols,,,990,1.267308,46.362702
2020-1269098,2020-12-28,000001,Vente,9000,,,LES BATIDES NORD,B003,87890,87080,Jouac,87,,,870800000A0638,,,,,,,,,,,,,0,,,,,L,landes,,,2590,1.267514,46.363085
