id_mutation,date_mutation,numero_disposition,nature_mutation,valeur_fonciere,adresse_numero,adresse_suffixe,adresse_nom_voie,adresse_code_voie,code_postal,code_commune,nom_commune,code_departement,ancien_code_commune,ancien_nom_commune,id_parcelle,ancien_id_parcelle,numero_volume,lot1_numero,lot1_surface_carrez,lot2_numero,lot2_surface_carrez,lot3_numero,lot3_surface_carrez,lot4_numero,lot4_surface_carrez,lot5_numero,lot5_surface_carrez,nombre_lots,code_type_local,type_local,surface_reelle_bati,nombre_pieces_principales,code_nature_culture,nature_culture,code_nature_culture_speciale,nature_culture_speciale,surface_terrain,longitude,latitude
2020-1260626,2020-01-02,000001,Vente,16000,23,,LE MONT,B118,87360,87087,Lussac-les-Églises,87,,,870870000D0112,,,,,,,,,,,,,0,1,Maison,32,0,S,sols,,,312,1.145117,46.335394
2020-1260626,2020-01-02,000001,Vente,16000,,,LE MONT,B118,87360,87087,Lussac-les-Églises,87,,,870870000D0119,,,,,,,,,,,,,0,,,,,J,jardins,,,357,1.14527,46.335433
2020-1260626,2020-01-02,000001,Vente,16000,,,LE MONT,B118,87360,87087,Lussac-les-Églises,87,,,870870000D0120,,,,,,,,,,,,,0,,,,,T,terres,,,910,1.145199,46.335168
2020-1260904,2020-01-31,000001,Vente,1250,,,LES CLOTURES,B048,87360,87087,Lussac-les-Églises,87,,,870870000E0910,,,,,,,,,,,,,0,,,,,S,sols,,,54,1.176997,46.315566
2020-1261031,2020-01-22,000001,Vente,50000,,,LES BOUIGES,B019,87360,87087,Lussac-les-Églises,87,,,870870000F0920,,,,,,,,,,,,,0,,,,,S,sols,,,8,1.199261,46.324647
2020-1261031,2020-01-22,000001,Vente,50000,,,LES BOUIGES,B019,87360,87087,Lussac-les-Églises,87,,,870870000F0921,,,,,,,,,,,,,0,,,,,J,jardins,,,380,1.199333,46.324602
2020-1261031,2020-01-22,000001,Vente,50000,,,LES BOUIGES,B019,87360,87087,Lussac-les-Églises,87,,,870870000F0978,,,,,,,,,,,,,0,,,,,T,terres,,,390,1.199406,46.324913
2020-1261031,2020-01-22,000001,Vente,50000,,,LES BOUIGES,B019,87360,87087,Lussac-les-Églises,87,,,870870000F0979,,,,,,,,,,,,,0,,,,,T,terres,,,185,1.199177,46.325108
2020-1261031,2020-01-22,000001,Vente,50000,,,LES BOUIGES,B019,87360,87087,Lussac-les-Églises,87,,,870870000F0980,,,,,,,,,,,,,0,,,,,T,terres,,,203,1.199204,46.325046
2020-1261031,2020-01-22,000001,Vente,50000,,,LES BOUIGES,B019,87360,87087,Lussac-les-Églises,87,,,870870000F0981,,,,,,,,,,,,,0,,,,,J,jardins,,,320,1.199178,46.324954
2020-1261031,2020-01-22,000001,Vente,50000,4,,LES BOUIGES,B019,87360,87087,Lussac-les-Églises,87,,,870870000F0982,,,,,,,,,,,,,0,1,Maison,42,2,S,sols,,,155,1.199223,46.324871
2020-1261031,2020-01-22,000001,Vente,50000,,,LES BOUIGES,B019,87360,87087,Lussac-les-Églises,87,,,870870000F1303,,,,,,,,,,,,,0,,,,,L,landes,,,132,1.199196,46.324788
2020-1261900,2020-02-21,000001,Vente,23000,,,LES BOUIGES,B019,87360,87087,Lussac-les-Églises,87,,,870870000F0940,,,,,,,,,,,,,0,,,,,L,landes,,,55,1.200292,46.325443
2020-1261900,2020-02-21,000001,Vente,23000,,,LES BOUIGES,B019,87360,87087,Lussac-les-Églises,87,,,870870000F0941,,,,,,,,,,,,,0,,,,,S,sols,,,65,1.200074,46.325497
2020-1261900,2020-02-21,000001,Vente,23000,,,LES BOUIGES,B019,87360,87087,Lussac-les-Églises,87,,,870870000F0942,,,,,,,,,,,,,0,,,,,S,sols,,,70,1.199995,46.32546
2020-1261900,2020-02-21,000001,Vente,23000,3,,LES BOUIGES,B019,87360,87087,Lussac-les-Églises,87,,,870870000F0943,,,,,,,,,,,,,0,2,Appartement,24,1,S,sols,,,260,1.199925,46.325469
2020-1261900,2020-02-21,000001,Vente,23000,3,,LES BOUIGES,B019,87360,87087,Lussac-les-Églises,87,,,870870000F0943,,,,,,,,,,,,,0,2,Appartement,24,1,S,sols,,,260,1.199925,46.325469
2020-1261900,2020-02-21,000001,Vente,23000,,,LES BOUIGES,B019,87360,87087,Lussac-les-Églises,87,,,870870000F0944,,,,,,,,,,,,,0,,,,,J,jardins,,,257,1.199969,46.325546
2020-1261900,2020-02-21,000001,Vente,23000,,,LES BOUIGES,B019,87360,87087,Lussac-les-Églises,87,,,870870000F0967,,,,,,,,,,,,,0,,,,,T,terres,,,3675,1.198726,46.325608
2020-1261900,2020-02-21,000001,Vente,23000,,,LES BOUIGES,B019,87360,87087,Lussac-les-Églises,87,,,870870000F0974,,,,,,,,,,,,,0,,,,,T,terres,,,300,1.199252,46.32543
2020-1261904,2020-03-12,000001,Vente,95000,41,,RUE PAULE DUBREUIL,0070,87360,87087,Lussac-les-Églises,87,,,870870000C1040,,,,,,,,,,,,,0,1,Maison,87,4,S,sols,,,1042,1.170561,46.342434
2020-1262522,2020-04-07,000001,Vente,1000,,,LA TRIGALLE,B175,87360,87087,Lussac-les-Églises,87,,,870870000E1141,,,,,,,,,,,,,0,,,,,T,terres,,,450,1.176892,46.338471
2020-1262638,2020-04-24,000001,Vente,86030,,,LES BOUIGES,B019,87360,87087,Lussac-les-Églises,87,,,870870000F0895,,,,,,,,,,,,,0,,,,,BT,taillis simples,,,160,1.202343,46.324592
2020-1262638,2020-04-24,000001,Vente,86030,9,,LES BOUIGES,B019,87360,87087,Lussac-les-Églises,87,,,870870000F0958,,,,,,,,,,,,,0,1,Maison,160,3,S,sols,,,365,1.199465,46.326354
2020-1262638,2020-04-24,000001,Vente,86030,,,LES BOUIGES,B019,87360,87087,Lussac-les-Églises,87,,,870870000F0964,,,,,,,,,,,,,0,,,,,J,jardins,,,875,1.199303,46.326234
2020-1262638,2020-04-24,000001,Vente,86030,,,LES BOUIGES,B019,87360,87087,Lussac-les-Églises,87,,,870870000F0965,,,,,,,,,,,,,0,,,,,S,sols,,,145,1.198985,46.326238
2020-1263625,2020-06-12,000001,Vente,80000,2,,RUE JEAN BRAC,0065,87360,87087,Lussac-les-Églises,87,,,870870000C0291,,,,,,,,,,,,,0,4,Local industriel. commercial ou assimilé,68,0,S,sols,,,218,1.174571,46.345101
2020-1263625,2020-06-12,000001,Vente,80000,2,,RUE JEAN BRAC,0065,87360,87087,Lussac-les-Églises,87,,,870870000C0291,,,,,,,,,,,,,0,1,Maison,123,8,S,sols,,,218,1.174571,46.345101
2020-1263910,2020-06-23,000001,Vente,11008.35,,,DES CHINAUDS,B041,87360,87087,Lussac-les-Églises,87,,,870870000D0486,,,,,,,,,,,,,0,,,,,L,landes,,,418,1.162485,46.33023
2020-1263910,2020-06-23,000001,Vente,11008.35,,,LA TREMBLADE,B174,87360,87087,Lussac-les-Églises,87,,,870870000D1155,,,,,,,,,,,,,0,,,,,T,terres,,,11345,1.177171,46.3222
2020-1263910,2020-06-23,000001,Vente,11008.35,,,LA TREMBLADE,B174,87360,87087,Lussac-les-Églises,87,,,870870000D1156,,,,,,,,,,,,,0,,,,,BT,taillis simples,,,3115,1.177273,46.321323
2020-1263910,2020-06-23,000001,Vente,11008.35,,,LA MALADRERIE,B116,87360,87087,Lussac-les-Églises,87,,,870870000E0165,,,,,,,,,,,,,0,,,,,T,terres,,,2291,1.178226,46.330298
2020-1263910,2020-06-23,000001,Vente,11008.35,,,LA MALADRERIE,B116,87360,87087,Lussac-les-Églises,87,,,870870000E0208,,,,,,,,,,,,,0,,,,,B,bois,CHAT,Châtaigneraie,350,1.173838,46.332055
2020-1263910,2020-06-23,000001,Vente,11008.35,,,LA MALADRERIE,B116,87360,87087,Lussac-les-Églises,87,,,870870000E0210,,,,,,,,,,,,,0,,,,,B,bois,CHAT,Châtaigneraie,860,1.174227,46.331948
2020-1263910,2020-06-23,000001,Vente,11008.35,,,LES GIBOUDRAS,B083,87360,87087,Lussac-les-Églises,87,,,870870000E0381,,,,,,,,,,,,,0,,,,,B,bois,CHAT,Châtaigneraie,6370,1.16066,46.335222
2020-1263910,2020-06-23,000001,Vente,11008.35,,,LANDES DU FIEF,B105,87360,87087,Lussac-les-Églises,87,,,870870000E0576,,,,,,,,,,,,,0,,,,,T,terres,,,2552,1.183093,46.321957
2020-1263910,2020-06-23,000001,Vente,11008.35,,,LANDES DU FIEF,B105,87360,87087,Lussac-les-Églises,87,,,870870000E0592,,,,,,,,,,,,,0,,,,,T,terres,,,7177,1.18022,46.319868
2020-1263910,2020-06-23,000001,Vente,11008.35,,,LANDES DU FIEF,B105,87360,87087,Lussac-les-Églises,87,,,870870000E0593,,,,,,,,,,,,,0,,,,,P,prés,,,813,1.181051,46.319579
2020-1263910,2020-06-23,000001,Vente,11008.35,,,LANDES DU FIEF,B105,87360,87087,Lussac-les-Églises,87,,,870870000E0597,,,,,,,,,,,,,0,,,,,T,terres,,,3023,1.180117,46.317757
2020-1263910,2020-06-23,000001,Vente,11008.35,,,LANDES DU FIEF,B105,87360,87087,Lussac-les-Églises,87,,,870870000E0599,,,,,,,,,,,,,0,,,,,T,terres,,,11147,1.179835,46.319038
2020-1263910,2020-06-23,000001,Vente,11008.35,,,LANDES DU FIEF,B105,87360,87087,Lussac-les-Églises,87,,,870870000E0606,,,,,,,,,,,,,0,,,,,T,terres,,,5062,1.178242,46.323494
2020-1263910,2020-06-23,000001,Vente,11008.35,,,LANDES DU FIEF,B105,87360,87087,Lussac-les-Églises,87,,,870870000E1233,,,,,,,,,,,,,0,,,,,T,terres,,,18866,1.178355,46.321354
2020-1264835,2020-07-28,000001,Vente,28000,29,,LE MONT,B118,87360,87087,Lussac-les-Églises,87,,,870870000D0137,,,,,,,,,,,,,0,,,,,S,sols,,,213,1.144177,46.334072
2020-1264835,2020-07-28,000001,Vente,28000,,,LE MONT,B118,87360,87087,Lussac-les-Églises,87,,,870870000D0139,,,,,,,,,,,,,0,,,,,T,terres,,,555,1.143671,46.334059
2020-1264835,2020-07-28,000001,Vente,28000,,,DERRIERE LES VIGNES,B061,87360,87087,Lussac-les-Églises,87,,,870870000D0245,,,,,,,,,,,,,0,,,,,T,terres,,,980,1.143178,46.33371
2020-1264835,2020-07-28,000001,Vente,28000,,,DERRIERE LES VIGNES,B061,87360,87087,Lussac-les-Églises,87,,,870870000D1418,,,,,,,,,,,,,0,,,,,T,terres,,,6520,1.14344,46.333795
2020-1264857,2020-07-28,000001,Vente,77000,5699,,RUE DES ANCIENS FOSSES,0005,87360,87087,Lussac-les-Églises,87,,,870870000C1261,,,,,,,,,,,,,0,3,Dépendance,,0,S,sols,,,53,1.175286,46.345582
2020-1264857,2020-07-28,000001,Vente,77000,2,,RUE DES ANCIENS FOSSES,0005,87360,87087,Lussac-les-Églises,87,,,870870000C1262,,,,,,,,,,,,,0,1,Maison,80,4,S,sols,,,259,1.175329,46.345433
2020-1264857,2020-07-28,000001,Vente,77000,,,RUE DES ANCIENS FOSSES,0005,87360,87087,Lussac-les-Églises,87,,,870870000C1263,,,,,,,,,,,,,0,,,,,S,sols,,,34,1.175497,46.345398
2020-1265094,2020-07-16,000001,Vente,45000,,,LE BOURG,B022,87360,87087,Lussac-les-Églises,87,,,870870000C0342,,,,,,,,,,,,,0,,,,,J,jardins,,,480,1.173823,46.343077
2020-1265094,2020-07-16,000001,Vente,45000,4,,RUE SAINT LOUIS,0115,87360,87087,Lussac-les-Églises,87,,,870870000C0354,,,,,,,,,,,,,0,1,Maison,100,3,S,sols,,,104,1.173441,46.343108
2020-1265094,2020-07-16,000001,Vente,45000,,,LE BOURG,B022,87360,87087,Lussac-les-Églises,87,,,870870000C1053,,,,,,,,,,,,,0,,,,,J,jardins,,,84,1.173957,46.342859
2020-1265094,2020-07-16,000001,Vente,45000,,,LE BOURG,B022,87360,87087,Lussac-les-Églises,87,,,870870000C1054,,,,,,,,,,,,,0,,,,,S,sols,,,249,1.173764,46.342989
2020-1265094,2020-07-16,000001,Vente,45000,,,LE BOURG,B022,87360,87087,Lussac-les-Églises,87,,,870870000C1056,,,,,,,,,,,,,0,,,,,S,sols,,,13,1.173385,46.343058
2020-1266228,2020-09-10,000001,Vente,44000,,,LE GALET,B079,87360,87087,Lussac-les-Églises,87,,,870870000F0200,,,,,,,,,,,,,0,,,,,P,prés,,,6525,1.2014,46.332893
2020-1266228,2020-09-10,000001,Vente,44000,,,LE GALET,B079,87360,87087,Lussac-les-Églises,87,,,870870000F0201,,,,,,,,,,,,,0,,,,,P,prés,,,3265,1.20193,46.332799
2020-1266228,2020-09-10,000001,Vente,44000,15,,ROUSSINE,B160,87360,87087,Lussac-les-Églises,87,,,870870000F0221,,,,,,,,,,,,,0,1,Maison,117,4,S,sols,,,635,1.200442,46.33399
2020-1266849,2020-10-20,000001,Vente,75000,3,,RUE DE LA FONT,0025,87360,87087,Lussac-les-Églises,87,,,870870000C1011,,,,,,,,,,,,,0,1,Maison,86,3,S,sols,,,95,1.176254,46.343609
2020-1266849,2020-10-20,000001,Vente,75000,,,LE BOURG,B022,87360,87087,Lussac-les-Églises,87,,,870870000C1013,,,,,,,,,,,,,0,,,,,S,sols,,,308,1.176209,46.343675
2020-1267313,2020-10-20,000001,Vente,56000,,,LE CROS,B059,87360,87087,Lussac-les-Églises,87,,,870870000A0075,,,,,,,,,,,,,0,,,,,P,prés,,,1057,1.154114,46.382056
2020-1267313,2020-10-20,000001,Vente,56000,,,LE CROS,B059,87360,87087,Lussac-les-Églises,87,,,870870000A0076,,,,,,,,,,,,,0,,,,,P,prés,,,4104,1.153854,46.381873
2020-1267313,2020-10-20,000001,Vente,56000,,,LE CROS,B059,87360,87087,Lussac-les-Églises,87,,,870870000A0076,,,,,,,,,,,,,0,,,,,S,sols,,,138,1.153854,46.381873
2020-1267313,2020-10-20,000001,Vente,56000,3,,LE CROS,B059,87360,87087,Lussac-les-Églises,87,,,870870000A0077,,,,,,,,,,,,,0,1,Maison,100,4,S,sols,,,714,1.154288,46.38178
2020-1267313,2020-10-20,000001,Vente,56000,,,LE CROS,B059,87360,87087,Lussac-les-Églises,87,,,870870000A0078,,,,,,,,,,,,,0,,,,,T,terres,,,5178,1.154049,46.381272
2020-1267313,2020-10-20,000001,Vente,56000,,,LE CROS,B059,87360,87087,Lussac-les-Églises,87,,,870870000A0078,,,,,,,,,,,,,0,,,,,S,sols,,,500,1.154049,46.381272
2020-1267313,2020-10-20,000001,Vente,56000,,,LE CROS,B059,87360,87087,Lussac-les-Églises,87,,,870870000A0086,,,,,,,,,,,,,0,,,,,P,prés,,,7428,1.152119,46.381927
2020-1267396,2020-10-29,000001,Vente,24000,,,LA GLIANDRETTE,B084,87360,87087,Lussac-les-Églises,87,,,870870000F0025,,,,,,,,,,,,,0,,,,,S,sols,,,80,1.196086,46.338526
2020-1267396,2020-10-29,000001,Vente,24000,1,,LA GUILLAUDRETTE,B183,87360,87087,Lussac-les-Églises,87,,,870870000F0026,,,,,,,,,,,,,0,1,Maison,38,2,S,sols,,,750,1.196357,46.338479
2020-1267396,2020-10-29,000001,Vente,24000,,,LA GLIANDRETTE,B084,87360,87087,Lussac-les-Églises,87,,,870870000F0028,,,,,,,,,,,,,0,,,,,J,jardins,,,582,1.196633,46.338468
2020-1267396,2020-10-29,000001,Vente,24000,,,LA GLIANDRETTE,B084,87360,87087,Lussac-les-Églises,87,,,870870000F0029,,,,,,,,,,,,,0,,,,,S,sols,,,65,1.196254,46.338611
2020-1268035,2020-11-04,000001,Vente,500,,,LE MONT,B118,87360,87087,Lussac-les-Églises,87,,,870870000D0050,,,,,,,,,,,,,0,,,,,P,prés,,,470,1.14376,46.336942
2020-1268035,2020-11-04,000001,Vente,500,,,LE MONT,B118,87360,87087,Lussac-les-Églises,87,,,870870000D0051,,,,,,,,,,,,,0,,,,,P,prés,,,230,1.143703,46.337048
2020-1268035,2020-11-04,000001,Vente,500,,,LE MONT,B118,87360,87087,Lussac-les-Églises,87,,,870870000D0053,,,,,,,,,,,,,0,,,,,P,prés,,,315,1.143572,46.337158
2020-1268035,2020-11-04,000001,Vente,500,,,LE MONT,B118,87360,87087,Lussac-les-Églises,87,,,870870000D0073,,,,,,,,,,,,,0,,,,,S,sols,,,112,1.143579,46.336599
2020-1268035,2020-11-04,000001,Vente,500,12,,LE MONT,B118,87360,87087,Lussac-les-Églises,87,,,870870000D0074,,,,,,,,,,,,,0,1,Maison,50,2,S,sols,,,150,1.143694,46.336633
2020-1268035,2020-11-04,000001,Vente,500,,,LE MONT,B118,87360,87087,Lussac-les-Églises,87,,,870870000D0075,,,,,,,,,,,,,0,,,,,J,jardins,,,75,1.143551,46.336817
2020-1268035,2020-11-04,000001,Vente,500,,,LE MONT,B118,87360,87087,Lussac-les-Églises,87,,,870870000D0080,,,,,,,,,,,,,0,,,,,S,sols,,,10,1.143877,46.336536
2020-1268035,2020-11-04,000001,Vente,500,,,LE MONT,B118,87360,87087,Lussac-les-Églises,87,,,870870000D1378,,,,,,,,,,,,,0,,,,,S,sols,,,24,1.143539,46.33655
2020-1268035,2020-11-04,000001,Vente,500,,,LE MONT,B118,87360,87087,Lussac-les-Églises,87,,,870870000D1464,,,,,,,,,,,,,0,,,,,J,jardins,,,37,1.14358,46.336885
2020-1268375,2020-11-27,000001,Vente,9000,16,,LA GRIMINIERE,B098,87360,87087,Lussac-les-Églises,87,,,870870000A0325,,,,,,,,,,,,,0,3,Dépendance,,0,S,sols,,,435,1.173678,46.382637
2020-1268375,2020-11-27,000001,Vente,9000,,,LA GRIMINIERE,B098,87360,87087,Lussac-les-Églises,87,,,870870000A0662,,,,,,,,,,,,,0,,,,,P,prés,,,1023,1.173912,46.382809
2020-1268541,2020-12-09,000001,Vente,95805,34,,RUE PAULE DUBREUIL,0070,87360,87087,Lussac-les-Églises,87,,,870870000C1075,,,,,,,,,,,,,0,1,Maison,93,5,T,terres,,,1805,1.170457,46.342854
2020-1268541,2020-12-09,000001,Vente,95805,34,,RUE PAULE DUBREUIL,0070,87360,87087,Lussac-les-Églises,87,,,870870000C1075,,,,,,,,,,,,,0,1,Maison,93,5,S,sols,,,850,1.170457,46.342854
2020-1268617,2020-12-10,000001,Vente,263000,,,LA MALADRERIE,B116,87360,87087,Lussac-les-Églises,87,,,870870000E0166,,,,,,,,,,,,,0,,,,,T,terres,,,1533,1.178202,46.330495
2020-1268617,2020-12-10,000001,Vente,263000,,,LA MALADRERIE,B116,87360,87087,Lussac-les-Églises,87,,,870870000E0169,,,,,,,,,,,,,0,,,,,T,terres,,,3600,1.178228,46.331109
2020-1268617,2020-12-10,000001,Vente,263000,,,LA MALADRERIE,B116,87360,87087,Lussac-les-Églises,87,,,870870000E0171,,,,,,,,,,,,,0,,,,,L,landes,,,46,1.177638,46.331619
2020-1268617,2020-12-10,000001,Vente,263000,5542,,LA MALADRERIE,B116,87360,87087,Lussac-les-Églises,87,,,870870000E0172,,,,,,,,,,,,,0,3,Dépendance,,0,P,prés,,,7680,1.177889,46.331719
2020-1268617,2020-12-10,000001,Vente,263000,5542,,LA MALADRERIE,B116,87360,87087,Lussac-les-Églises,87,,,870870000E0172,,,,,,,,,,,,,0,3,Dépendance,,0,S,sols,,,100,1.177889,46.331719
2020-1268617,2020-12-10,000001,Vente,263000,,,LA MALADRERIE,B116,87360,87087,Lussac-les-Églises,87,,,870870000E0173,,,,,,,,,,,,,0,,,,,T,terres,,,2889,1.177934,46.332567
2020-1268617,2020-12-10,000001,Vente,263000,,,LA MALADRERIE,B116,87360,87087,Lussac-les-Églises,87,,,870870000E0174,,,,,,,,,,,,,0,,,,,T,terres,,,265,1.177783,46.332468
2020-1268617,2020-12-10,000001,Vente,263000,,,LA MALADRERIE,B116,87360,87087,Lussac-les-Églises,87,,,870870000E0175,,,,,,,,,,,,,0,,,,,S,sols,,,753,1.177222,46.332414
2020-1268617,2020-12-10,000001,Vente,263000,5569,,LA MALADRERIE,B116,87360,87087,Lussac-les-Églises,87,,,870870000E0176,,,,,,,,,,,,,0,1,Maison,50,3,S,sols,,,360,1.176964,46.332329
2020-1268617,2020-12-10,000001,Vente,263000,4,,LA MALADRERIE,B116,87360,87087,Lussac-les-Églises,87,,,870870000E0177,,,,,,,,,,,,,0,1,Maison,113,6,S,sols,,,1033,1.177489,46.332264
2020-1268617,2020-12-10,000001,Vente,263000,,,LA MALADRERIE,B116,87360,87087,Lussac-les-Églises,87,,,870870000E0201,,,,,,,,,,,,,0,,,,,P,prés,,,7005,1.175962,46.333747
2020-1268617,2020-12-10,000001,Vente,263000,,,LA MALADRERIE,B116,87360,87087,Lussac-les-Églises,87,,,870870000E0223,,,,,,,,,,,,,0,,,,,T,terres,,,5610,1.177489,46.330903
2020-1268617,2020-12-10,000001,Vente,263000,,,LA MALADRERIE,B116,87360,87087,Lussac-les-Églises,87,,,870870000E0224,,,,,,,,,,,,,0,,,,,T,terres,,,5220,1.177721,46.329806
2020-1268617,2020-12-10,000001,Vente,263000,,,LA MALADRERIE,B116,87360,87087,Lussac-les-Églises,87,,,870870000E0225,,,,,,,,,,,,,0,,,,,T,terres,,,12360,1.176259,46.330373
2020-1268617,2020-12-10,000001,Vente,263000,,,LA MALADRERIE,B116,87360,87087,Lussac-les-Églises,87,,,870870000E1173,,,,,,,,,,,,,0,,,,,J,jardins,,,250,1.177135,46.332228
2020-1268617,2020-12-10,000001,Vente,263000,,,LA MALADRERIE,B116,87360,87087,Lussac-les-Églises,87,,,870870000E1174,,,,,,,,,,,,,0,,,,,J,jardins,,,96,1.177602,46.331955
2020-1268622,2020-11-20,000001,Vente,2000,,,LA VILLATTE,B181,87360,87087,Lussac-les-Églises,87,,,870870000D0904,,,,,,,,,,,,,0,,,,,BT,taillis simples,,,565,1.16613,46.326937
2020-1268622,2020-11-20,000001,Vente,2000,,,LA VILLATTE,B181,87360,87087,Lussac-les-Églises,87,,,870870000D0919,,,,,,,,,,,,,0,,,,,P,prés,,,93,1.165764,46.327648
2020-1268622,2020-11-20,000001,Vente,2000,,,LA VILLATTE,B181,87360,87087,Lussac-les-Églises,87,,,870870000D0920,,,,,,,,,,,,,0,,,,,J,jardins,,,293,1.165879,46.327753
2020-1268622,2020-11-20,000001,Vente,2000,,,LA VILLATTE,B181,87360,87087,Lussac-les-Églises,87,,,870870000D0939,,,,,,,,,,,,,0,,,,,S,sols,,,6,1.166797,46.328582
2020-1268622,2020-11-20,000001,Vente,2000,,,LA VILLATTE,B181,87360,87087,Lussac-les-Églises,87,,,870870000D0940,,,,,,,,,,,,,0,,,,,P,prés,,,995,1.166939,46.32848
2020-1268622,2020-11-20,000001,Vente,2000,,,LES BAIGES,B006,87360,87087,Lussac-les-Églises,87,,,870870000D1075,,,,,,,,,,,,,0,,,,,P,prés,,,3530,1.16697,46.327859
2020-1268623,2020-11-20,000001,Vente,85000,,,LA VILLATTE,B181,87360,87087,Lussac-les-Églises,87,,,870870000D0905,,,,,,,,,,,,,0,,,,,T,terres,,,1390,1.166677,46.327174
2020-1268623,2020-11-20,000001,Vente,85000,,,LA VILLATTE,B181,87360,87087,Lussac-les-Églises,87,,,870870000D0906,,,,,,,,,,,,,0,,,,,P,prés,,,165,1.166769,46.327481
2020-1268623,2020-11-20,000001,Vente,85000,,,LA VILLATTE,B181,87360,87087,Lussac-les-Églises,87,,,870870000D0907,,,,,,,,,,,,,0,,,,,P,prés,,,165,1.166724,46.32751
2020-1268623,2020-11-20,000001,Vente,85000,,,LA VILLATTE,B181,87360,87087,Lussac-les-Églises,87,,,870870000D0908,,,,,,,,,,,,,0,,,,,P,prés,,,725,1.166526,46.327303
2020-1268623,2020-11-20,000001,Vente,85000,,,LA VILLATTE,B181,87360,87087,Lussac-les-Églises,87,,,870870000D0909,,,,,,,,,,,,,0,,,,,P,prés,,,580,1.166497,46.32744
2020-1268623,2020-11-20,000001,Vente,85000,,,LA VILLATTE,B181,87360,87087,Lussac-les-Églises,87,,,870870000D0910,,,,,,,,,,,,,0,,,,,P,prés,,,370,1.166377,46.327431
2020-1268623,2020-11-20,000001,Vente,85000,,,LA VILLATTE,B181,87360,87087,Lussac-les-Églises,87,,,870870000D0911,,,,,,,,,,,,,0,,,,,P,prés,,,190,1.166474,46.327614
2020-1268623,2020-11-20,000001,Vente,85000,,,LA VILLATTE,B181,87360,87087,Lussac-les-Églises,87,,,870870000D0912,,,,,,,,,,,,,0,,,,,P,prés,,,190,1.166394,46.327607
2020-1268623,2020-11-20,000001,Vente,85000,,,LA VILLATTE,B181,87360,87087,Lussac-les-Églises,87,,,870870000D0913,,,,,,,,,,,,,0,,,,,J,jardins,,,530,1.166123,46.327348
2020-1268623,2020-11-20,000001,Vente,85000,,,LA VILLATTE,B181,87360,87087,Lussac-les-Églises,87,,,870870000D0914,,,,,,,,,,,,,0,,,,,J,jardins,,,70,1.166163,46.327423
2020-1268623,2020-11-20,000001,Vente,85000,,,LA VILLATTE,B181,87360,87087,Lussac-les-Églises,87,,,870870000D0915,,,,,,,,,,,,,0,,,,,J,jardins,,,75,1.166157,46.327483
2020-1268623,2020-11-20,000001,Vente,85000,,,LA VILLATTE,B181,87360,87087,Lussac-les-Églises,87,,,870870000D0916,,,,,,,,,,,,,0,,,,,J,jardins,,,370,1.166346,46.327676
2020-1268623,2020-11-20,000001,Vente,85000,,,LA VILLATTE,B181,87360,87087,Lussac-les-Églises,87,,,870870000D0917,,,,,,,,,,,,,0,,,,,J,jardins,,,415,1.166201,46.32761
2020-1268623,2020-11-20,000001,Vente,85000,,,LA VILLATTE,B181,87360,87087,Lussac-les-Églises,87,,,870870000D0918,,,,,,,,,,,,,0,,,,,P,prés,,,1544,1.165943,46.327576
2020-1268623,2020-11-20,000001,Vente,85000,,,LA VILLATTE,B181,87360,87087,Lussac-les-Églises,87,,,870870000D0921,,,,,,,,,,,,,0,,,,,J,jardins,,,350,1.16596,46.327896
2020-1268623,2020-11-20,000001,Vente,85000,,,LA VILLATTE,B181,87360,87087,Lussac-les-Églises,87,,,870870000D0922,,,,,,,,,,,,,0,,,,,P,prés,,,210,1.165876,46.327991
2020-1268623,2020-11-20,000001,Vente,85000,,,LA VILLATTE,B181,87360,87087,Lussac-les-Églises,87,,,870870000D0923,,,,,,,,,,,,,0,,,,,P,prés,,,110,1.1659,46.328039
2020-1268623,2020-11-20,000001,Vente,85000,,,LA VILLATTE,B181,87360,87087,Lussac-les-Églises,87,,,870870000D0924,,,,,,,,,,,,,0,,,,,P,prés,,,115,1.165992,46.328078
2020-1268623,2020-11-20,000001,Vente,85000,,,LA VILLATTE,B181,87360,87087,Lussac-les-Églises,87,,,870870000D0925,,,,,,,,,,,,,0,,,,,J,jardins,,,98,1.165838,46.328159
2020-1268623,2020-11-20,000001,Vente,85000,,,LA VILLATTE,B181,87360,87087,Lussac-les-Églises,87,,,870870000D0926,,,,,,,,,,,,,0,,,,,P,prés,,,230,1.166019,46.328126
2020-1268623,2020-11-20,000001,Vente,85000,,,LA VILLATTE,B181,87360,87087,Lussac-les-Églises,87,,,870870000D0927,,,,,,,,,,,,,0,,,,,P,prés,,,25,1.166164,46.328097
2020-1268623,2020-11-20,000001,Vente,85000,,,LA VILLATTE,B181,87360,87087,Lussac-les-Églises,87,,,870870000D0928,,,,,,,,,,,,,0,,,,,P,prés,,,30,1.16617,46.328053
2020-1268623,2020-11-20,000001,Vente,85000,,,LA VILLATTE,B181,87360,87087,Lussac-les-Églises,87,,,870870000D0929,,,,,,,,,,,,,0,,,,,P,prés,,,30,1.16615,46.327983
2020-1268623,2020-11-20,000001,Vente,85000,,,LA VILLATTE,B181,87360,87087,Lussac-les-Églises,87,,,870870000D0930,,,,,,,,,,,,,0,,,,,P,prés,,,65,1.1662,46.328007
2020-1268623,2020-11-20,000001,Vente,85000,,,LA VILLATTE,B181,87360,87087,Lussac-les-Églises,87,,,870870000D0931,,,,,,,,,,,,,0,,,,,P,prés,,,70,1.166292,46.328069
2020-1268623,2020-11-20,000001,Vente,85000,,,LA VILLATTE,B181,87360,87087,Lussac-les-Églises,87,,,870870000D0932,,,,,,,,,,,,,0,,,,,P,prés,,,80,1.166419,46.327942
2020-1268623,2020-11-20,000001,Vente,85000,,,LA VILLATTE,B181,87360,87087,Lussac-les-Églises,87,,,870870000D0933,,,,,,,,,,,,,0,,,,,P,prés,,,235,1.166495,46.327998
2020-1268623,2020-11-20,000001,Vente,85000,,,LA VILLATTE,B181,87360,87087,Lussac-les-Églises,87,,,870870000D0934,,,,,,,,,,,,,0,,,,,P,prés,,,425,1.166635,46.327959
2020-1268623,2020-11-20,000001,Vente,85000,,,LA VILLATTE,B181,87360,87087,Lussac-les-Églises,87,,,870870000D0935,,,,,,,,,,,,,0,,,,,P,prés,,,95,1.166685,46.327794
2020-1268623,2020-11-20,000001,Vente,85000,,,LA VILLATTE,B181,87360,87087,Lussac-les-Églises,87,,,870870000D0936,,,,,,,,,,,,,0,,,,,P,prés,,,120,1.166773,46.327977
2020-1268623,2020-11-20,000001,Vente,85000,,,LA VILLATTE,B181,87360,87087,Lussac-les-Églises,87,,,870870000D0937,,,,,,,,,,,,,0,,,,,J,jardins,,,50,1.166866,46.328085
2020-1268623,2020-11-20,000001,Vente,85000,,,LA VILLATTE,B181,87360,87087,Lussac-les-Églises,87,,,870870000D0938,,,,,,,,,,,,,0,,,,,J,jardins,,,225,1.166897,46.328146
2020-1268623,2020-11-20,000001,Vente,85000,,,LA VILLATTE,B181,87360,87087,Lussac-les-Églises,87,,,870870000D0941,,,,,,,,,,,,,0,,,,,P,prés,,,315,1.166771,46.328266
2020-1268623,2020-11-20,000001,Vente,85000,,,LA VILLATTE,B181,87360,87087,Lussac-les-Églises,87,,,870870000D0942,,,,,,,,,,,,,0,,,,,J,jardins,,,50,1.166812,46.328166