id_mutation,date_mutation,numero_disposition,nature_mutation,valeur_fonciere,adresse_numero,adresse_suffixe,adresse_nom_voie,adresse_code_voie,code_postal,code_commune,nom_commune,code_departement,ancien_code_commune,ancien_nom_commune,id_parcelle,ancien_id_parcelle,numero_volume,lot1_numero,lot1_surface_carrez,lot2_numero,lot2_surface_carrez,lot3_numero,lot3_surface_carrez,lot4_numero,lot4_surface_carrez,lot5_numero,lot5_surface_carrez,nombre_lots,code_type_local,type_local,surface_reelle_bati,nombre_pieces_principales,code_nature_culture,nature_culture,code_nature_culture_speciale,nature_culture_speciale,surface_terrain,longitude,latitude
2020-1260577,2020-01-06,000001,Vente,70000,13,,MAISON ROUGE,B146,87140,87103,Nantiat,87,,,871030000E0043,,,,,,,,,,,,,0,1,Maison,98,4,S,sols,,,453,1.160593,45.992618
2020-1260577,2020-01-06,000001,Vente,70000,,,MAISON ROUGE,B146,87140,87103,Nantiat,87,,,871030000E0144,,,,,,,,,,,,,0,,,,,J,jardins,,,197,1.160927,45.992565
2020-1260786,2020-01-16,000001,Vente terrain à bâtir,27094.08,10,,RUE DES CHATAIGNIERS,0069,87140,87103,Nantiat,87,,,87103000AM0392,,,,,,,,,,,,,0,,,,,AB,terrains a bâtir,,,676,1.178834,46.004476
2020-1261120,2020-02-06,000001,Vente,53333.33,,,PONT DE TAILLAC,B180,87140,87103,Nantiat,87,,,871030000E0159,,,,,,,,,,,,,0,,,,,L,landes,,,5430,1.158734,45.985408
2020-1261194,2020-01-28,000001,Vente,48000,12,,RUE DU CROS BLANC,0116,87140,87103,Nantiat,87,,,87103000AT0057,,,,,,,,,,,,,0,1,Maison,81,4,S,sols,,,438,1.167643,46.009191
2020-1261386,2020-01-30,000001,Vente,11354,,,LAS PEICHAS,B133,87140,87103,Nantiat,87,,,87103000AB0114,,,,,,,,,,,,,0,,,,,P,prés,,,7100,1.177931,46.0436
2020-1261386,2020-01-30,000001,Vente,11354,,,LAS PEICHAS,B133,87140,87103,Nantiat,87,,,87103000AB0116,,,,,,,,,,,,,0,,,,,P,prés,,,8193,1.178014,46.04241
2020-1261386,2020-01-30,000001,Vente,11354,,,LAS PEICHAS,B133,87140,87103,Nantiat,87,,,87103000AB0116,,,,,,,,,,,,,0,,,,,P,prés,,,16387,1.178014,46.04241
2020-1261386,2020-01-30,000001,Vente,11354,,,LAS PEICHAS,B133,87140,87103,Nantiat,87,,,87103000AB0117,,,,,,,,,,,,,0,,,,,P,prés,,,10350,1.17695,46.042059
2020-1261386,2020-01-30,000001,Vente,11354,,,L ETANG,B067,87140,87103,Nantiat,87,,,87103000AC0036,,,,,,,,,,,,,0,,,,,T,terres,,,4683,1.181674,46.043708
2020-1261386,2020-01-30,000001,Vente,11354,,,LES GRANDS CHAMPS,B111,87140,87103,Nantiat,87,,,87103000AC0042,,,,,,,,,,,,,0,,,,,T,terres,,,1267,1.183525,46.04332
2020-1261386,2020-01-30,000001,Vente,11354,,,LES BETOULLES,B006,87140,87103,Nantiat,87,,,87103000AC0061,,,,,,,,,,,,,0,,,,,T,terres,,,1714,1.187031,46.044363
2020-1261386,2020-01-30,000001,Vente,11354,,,LES CLUZEIX,B045,87140,87103,Nantiat,87,,,87103000AC0091,,,,,,,,,,,,,0,,,,,L,landes,,,594,1.183056,46.040943
2020-1261386,2020-01-30,000001,Vente,11354,,,LES CLUZEIX,B045,87140,87103,Nantiat,87,,,87103000AC0092,,,,,,,,,,,,,0,,,,,BS,taillis sous futaie,,,413,1.183384,46.040928
2020-1261386,2020-01-30,000001,Vente,11354,,,PUY REDON,B198,87140,87103,Nantiat,87,,,87103000AC0111,,,,,,,,,,,,,0,,,,,T,terres,,,1937,1.189232,46.040567
2020-1261386,2020-01-30,000001,Vente,11354,,,VERVOS,B223,87140,87103,Nantiat,87,,,87103000AC0179,,,,,,,,,,,,,0,,,,,T,terres,,,4130,1.182186,46.04098
2020-1261387,2020-01-30,000001,Vente,3000,,,CLAVIERES,B042,87140,87103,Nantiat,87,,,87103000AC0289,,,,,,,,,,,,,0,,,,,S,sols,,,360,1.179359,46.039273
2020-1261389,2020-01-30,000001,Vente,8192,,,LES LANDES,B121,87140,87103,Nantiat,87,,,87103000AC0008,,,,,,,,,,,,,0,,,,,P,prés,,,4938,1.177035,46.046683
2020-1261389,2020-01-30,000001,Vente,8192,,,LES LANDES,B121,87140,87103,Nantiat,87,,,87103000AC0009,,,,,,,,,,,,,0,,,,,P,prés,,,5390,1.177984,46.046443
2020-1261389,2020-01-30,000001,Vente,8192,,,LES LANDES,B121,87140,87103,Nantiat,87,,,87103000AC0009,,,,,,,,,,,,,0,,,,,P,prés,,,5390,1.177984,46.046443
2020-1261389,2020-01-30,000001,Vente,8192,,,LAS LIPAS,B132,87140,87103,Nantiat,87,,,87103000AD0073,,,,,,,,,,,,,0,,,,,T,terres,,,2111,1.180411,46.035602
2020-1261389,2020-01-30,000001,Vente,8192,,,LES VIEILLES,B224,87140,87103,Nantiat,87,,,87103000AD0147,,,,,,,,,,,,,0,,,,,T,terres,,,2750,1.180149,46.031679
2020-1261389,2020-01-30,000001,Vente,8192,,,LA MARZELLE,B148,87140,87103,Nantiat,87,,,87103000AD0153,,,,,,,,,,,,,0,,,,,T,terres,,,2045,1.179018,46.033072
2020-1261389,2020-01-30,000001,Vente,8192,,,LA MARZELLE,B148,87140,87103,Nantiat,87,,,87103000AD0153,,,,,,,,,,,,,0,,,,,T,terres,,,2045,1.179018,46.033072
2020-1261389,2020-01-30,000001,Vente,8192,,,LES COTES,B047,87140,87103,Nantiat,87,,,87103000AD0176,,,,,,,,,,,,,0,,,,,P,prés,,,8670,1.175956,46.032202
2020-1261389,2020-01-30,000001,Vente,8192,,,LES GRANDES PIECES,B110,87140,87103,Nantiat,87,,,87103000AD0237,,,,,,,,,,,,,0,,,,,T,terres,,,693,1.172149,46.033284
2020-1261389,2020-01-30,000001,Vente,8192,,,LES GRANDES PIECES,B110,87140,87103,Nantiat,87,,,87103000AD0238,,,,,,,,,,,,,0,,,,,T,terres,,,6926,1.172617,46.032816
2020-1261390,2020-01-30,000001,Vente,918,,,LES GRANDES PIECES,B110,87140,87103,Nantiat,87,,,87103000AD0219,,,,,,,,,,,,,0,,,,,T,terres,,,990,1.172242,46.032023
2020-1261390,2020-01-30,000001,Vente,918,,,LES GRANDES PIECES,B110,87140,87103,Nantiat,87,,,87103000AD0220,,,,,,,,,,,,,0,,,,,T,terres,,,3600,1.17255,46.031631
2020-1261419,2020-02-14,000001,Vente,80000,3,,RTE DES FRUITIERS,0173,87140,87103,Nantiat,87,,,87103000AC0293,,,,,,,,,,,,,0,1,Maison,150,6,S,sols,,,280,1.179163,46.038894
2020-1261426,2020-02-13,000001,Vente,959.52,,,PEU DEU SINGLARDS,B170,87140,87103,Nantiat,87,,,87103000AM0101,,,,,,,,,,,,,0,,,,,T,terres,,,874,1.180255,45.990538
2020-1261426,2020-02-13,000001,Vente,959.52,,,L AGE,B001,87140,87103,Nantiat,87,,,87103000AM0170,,,,,,,,,,,,,0,,,,,T,terres,,,3420,1.179191,45.992478
2020-1261426,2020-02-13,000001,Vente,959.52,,,FONTAULEGE,B080,87140,87103,Nantiat,87,,,87103000AM0208,,,,,,,,,,,,,0,,,,,T,terres,,,1703,1.179489,45.99275
2020-1261431,2020-02-20,000001,Vente,750,,,LE BOURG EST,B021,87140,87103,Nantiat,87,,,87103000AN0222,,,,,,,,,,,,,0,,,,,J,jardins,,,493,1.177887,46.010528
2020-1261431,2020-02-20,000001,Vente,750,,,LE BOURG EST,B021,87140,87103,Nantiat,87,,,87103000AN0224,,,,,,,,,,,,,0,,,,,J,jardins,,,256,1.178336,46.010759
2020-1261623,2020-02-25,000001,Vente,799.8,,,GAZEDOUERE,B091,87140,87103,Nantiat,87,,,871030000D0114,,,,,,,,,,,,,0,,,,,T,terres,,,5838,1.172251,45.994226
2020-1261623,2020-02-25,000001,Vente,799.8,,,GAZEDOUERE,B091,87140,87103,Nantiat,87,,,871030000D0116,,,,,,,,,,,,,0,,,,,B,bois,CHAT,Châtaigneraie,2160,1.171499,45.994325
2020-1261676,2020-02-19,000001,Vente,105000,9,,RTE DE FREDAIGUE,0172,87140,87103,Nantiat,87,,,87103000AK0262,,,,,,,,,,,,,0,1,Maison,85,5,S,sols,,,493,1.181312,46.013668
2020-1261676,2020-02-19,000001,Vente,105000,,,LA CROIX PAROT,B058,87140,87103,Nantiat,87,,,87103000AK0263,,,,,,,,,,,,,0,,,,,J,jardins,,,530,1.180893,46.013725
2020-1261676,2020-02-19,000001,Vente,105000,,,LA CROIX PAROT,B058,87140,87103,Nantiat,87,,,87103000AK0263,,,,,,,,,,,,,0,,,,,S,sols,,,110,1.180893,46.013725
2020-1261676,2020-02-19,000001,Vente,105000,,,LA CROIX PAROT,B058,87140,87103,Nantiat,87,,,87103000AK0360,,,,,,,,,,,,,0,,,,,T,terres,,,793,1.18092,46.01348
2020-1261791,2020-02-17,000001,Vente,55000,,,LAS TEISSAS,B136,87140,87103,Nantiat,87,,,87103000AC0159,,,,,,,,,,,,,0,,,,,B,bois,CHAT,Châtaigneraie,1980,1.185011,46.036028
2020-1261791,2020-02-17,000001,Vente,55000,,,LES BOIS,B007,87140,87103,Nantiat,87,,,87103000AC0190,,,,,,,,,,,,,0,,,,,B,bois,CHAT,Châtaigneraie,2267,1.184191,46.036803
2020-1261791,2020-02-17,000001,Vente,55000,,,LES BOIS,B007,87140,87103,Nantiat,87,,,87103000AC0190,,,,,,,,,,,,,0,,,,,BS,taillis sous futaie,,,1133,1.184191,46.036803
2020-1261791,2020-02-17,000001,Vente,55000,,,LES BOIS,B007,87140,87103,Nantiat,87,,,87103000AC0194,,,,,,,,,,,,,0,,,,,B,bois,CHAT,Châtaigneraie,280,1.183784,46.036371
2020-1261791,2020-02-17,000001,Vente,55000,,,CLAVIERES,B042,87140,87103,Nantiat,87,,,87103000AC0285,,,,,,,,,,,,,0,,,,,S,sols,,,118,1.179493,46.038851
2020-1261791,2020-02-17,000001,Vente,55000,,,CLAVIERES,B042,87140,87103,Nantiat,87,,,87103000AC0286,,,,,,,,,,,,,0,,,,,J,jardins,,,400,1.179662,46.038747
2020-1261791,2020-02-17,000001,Vente,55000,,,CLAVIERES,B042,87140,87103,Nantiat,87,,,87103000AC0288,,,,,,,,,,,,,0,,,,,T,terres,,,418,1.179613,46.038956
2020-1261791,2020-02-17,000001,Vente,55000,5,,RTE DES FRUITIERS,0173,87140,87103,Nantiat,87,,,87103000AC0291,,,,,,,,,,,,,0,1,Maison,82,3,S,sols,,,503,1.179277,46.039029
2020-1261791,2020-02-17,000001,Vente,55000,,,CLAVIERES,B042,87140,87103,Nantiat,87,,,87103000AC0292,,,,,,,,,,,,,0,,,,,J,jardins,,,150,1.179136,46.038987
2020-1261791,2020-02-17,000001,Vente,55000,,,CLAVIERES,B042,87140,87103,Nantiat,87,,,87103000AC0294,,,,,,,,,,,,,0,,,,,J,jardins,,,121,1.179006,46.03887
2020-1261791,2020-02-17,000001,Vente,55000,,,DE MAISON,B145,87140,87103,Nantiat,87,,,87103000AC0308,,,,,,,,,,,,,0,,,,,P,prés,,,4360,1.178342,46.039128
2020-1261791,2020-02-17,000001,Vente,55000,,,LA RIBIERE,B204,87140,87103,Nantiat,87,,,87103000AD0038,,,,,,,,,,,,,0,,,,,T,terres,,,3620,1.175527,46.038448
2020-1261791,2020-02-17,000001,Vente,55000,,,LA RIBIERE,B204,87140,87103,Nantiat,87,,,87103000AD0039,,,,,,,,,,,,,0,,,,,T,terres,,,3360,1.176263,46.038351
2020-1261791,2020-02-17,000001,Vente,55000,,,LAS LIPAS,B132,87140,87103,Nantiat,87,,,87103000AD0085,,,,,,,,,,,,,0,,,,,B,bois,CHAT,Châtaigneraie,2701,1.182823,46.035251
2020-1262186,2020-03-04,000001,Vente,3000,,,LES LANDAS,B117,87140,87103,Nantiat,87,,,87103000AP0133,,,,,,,,,,,,,0,,,,,L,landes,,,10770,1.161951,46.002981
2020-1262754,2020-04-30,000001,Vente,3500,,,LE BOUINOU,B018,87140,87103,Nantiat,87,,,87103000AM0175,,,,,,,,,,,,,0,,,,,T,terres,,,1429,1.179634,45.990784
2020-1262754,2020-04-30,000001,Vente,3500,,,LE BOUINOU,B018,87140,87103,Nantiat,87,,,87103000AM0176,,,,,,,,,,,,,0,,,,,T,terres,,,2784,1.179958,45.990941
2020-1262754,2020-04-30,000001,Vente,3500,,,LE GROS CHENE,B112,87140,87103,Nantiat,87,,,871030000D0253,,,,,,,,,,,,,0,,,,,T,terres,,,2190,1.176204,45.988692
2020-1262754,2020-04-30,000001,Vente,3500,,,LE GROS CHENE,B112,87140,87103,Nantiat,87,,,871030000D0262,,,,,,,,,,,,,0,,,,,B,bois,CHAT,Châtaigneraie,3960,1.176237,45.988288
2020-1262872,2020-04-30,000001,Vente,394,,,LE BOUINOU,B018,87140,87103,Nantiat,87,,,87103000AM0173,,,,,,,,,,,,,0,,,,,T,terres,,,795,1.17946,45.991317
2020-1262872,2020-04-30,000001,Vente,394,,,FONTAULEGE,B080,87140,87103,Nantiat,87,,,87103000AM0220,,,,,,,,,,,,,0,,,,,B,bois,CHAT,Châtaigneraie,161,1.177882,45.993659
2020-1262872,2020-04-30,000001,Vente,394,,,LE GROS CHENE,B112,87140,87103,Nantiat,87,,,871030000D0223,,,,,,,,,,,,,0,,,,,B,bois,CHAT,Châtaigneraie,476,1.172391,45.986298
2020-1263370,2020-05-26,000001,Vente,19344.76,,,LES RIBIERES,B206,87140,87103,Nantiat,87,,,87103000AE0022,,,,,,,,,,,,,0,,,,,P,prés,,,1430,1.180998,46.023961
2020-1263370,2020-05-26,000001,Vente,19344.76,,,LES RIBIERES,B206,87140,87103,Nantiat,87,,,87103000AE0024,,,,,,,,,,,,,0,,,,,P,prés,,,6130,1.18169,46.023647
2020-1263370,2020-05-26,000001,Vente,19344.76,,,LES CHARRAUDS,B031,87140,87103,Nantiat,87,,,87103000AE0163,,,,,,,,,,,,,0,,,,,P,prés,,,6847,1.180269,46.01961
2020-1263370,2020-05-26,000001,Vente,19344.76,,,LES CHARRAUDS,B031,87140,87103,Nantiat,87,,,87103000AE0163,,,,,,,,,,,,,0,,,,,P,prés,,,13693,1.180269,46.01961
2020-1263370,2020-05-26,000001,Vente,19344.76,,,LE RIVAUD,B207,87140,87103,Nantiat,87,,,87103000AE0185,,,,,,,,,,,,,0,,,,,T,terres,,,17240,1.18016,46.020768
2020-1263370,2020-05-26,000001,Vente,19344.76,,,LE RIVAUD,B207,87140,87103,Nantiat,87,,,87103000AE0188,,,,,,,,,,,,,0,,,,,T,terres,,,1937,1.1786,46.020685
2020-1263370,2020-05-26,000001,Vente,19344.76,,,LE RIVAUD,B207,87140,87103,Nantiat,87,,,87103000AE0191,,,,,,,,,,,,,0,,,,,T,terres,,,2220,1.179839,46.021214
2020-1263370,2020-05-26,000001,Vente,19344.76,,,LES CHERRAUX,B038,87140,87103,Nantiat,87,,,87103000AV0029,,,,,,,,,,,,,0,,,,,B,bois,CHAT,Châtaigneraie,1255,1.173652,46.025636
2020-1263370,2020-05-26,000001,Vente,19344.76,,,LES CHERRAUX,B038,87140,87103,Nantiat,87,,,87103000AV0030,,,,,,,,,,,,,0,,,,,T,terres,,,848,1.174181,46.025263
2020-1263370,2020-05-26,000001,Vente,19344.76,,,LES CHERRAUX,B038,87140,87103,Nantiat,87,,,87103000AV0038,,,,,,,,,,,,,0,,,,,T,terres,,,1137,1.177177,46.026461
2020-1263370,2020-05-26,000001,Vente,19344.76,,,LES GAILLARDOUX,B088,87140,87103,Nantiat,87,,,87103000AV0068,,,,,,,,,,,,,0,,,,,T,terres,,,2917,1.176823,46.018841
2020-1263370,2020-05-26,000001,Vente,19344.76,,,LES GAILLARDOUX,B088,87140,87103,Nantiat,87,,,87103000AV0069,,,,,,,,,,,,,0,,,,,T,terres,,,4870,1.176364,46.019106
2020-1263370,2020-05-26,000001,Vente,19344.76,,,LES GAILLARDOUX,B088,87140,87103,Nantiat,87,,,87103000AV0070,,,,,,,,,,,,,0,,,,,T,terres,,,9370,1.175031,46.019533
2020-1263370,2020-05-26,000001,Vente,19344.76,,,LES GAILLARDOUX,B088,87140,87103,Nantiat,87,,,87103000AV0073,,,,,,,,,,,,,0,,,,,P,prés,,,1681,1.175746,46.018777
2020-1263370,2020-05-26,000001,Vente,19344.76,,,VILLECHENOUX,B227,87140,87103,Nantiat,87,,,87103000AV0151,,,,,,,,,,,,,0,,,,,P,prés,,,16290,1.172873,46.025016
2020-1263370,2020-05-26,000001,Vente,19344.76,,,LES BETOULLES,B006,87140,87103,Nantiat,87,,,871030000F0138,,,,,,,,,,,,,0,,,,,P,prés,,,5610,1.166886,46.02328
2020-1263370,2020-05-26,000001,Vente,19344.76,,,LES DIGERES,B064,87140,87103,Nantiat,87,,,871030000F0150,,,,,,,,,,,,,0,,,,,T,terres,,,3200,1.172643,46.026711
2020-1263370,2020-05-26,000001,Vente,19344.76,,,LES DIGERES,B064,87140,87103,Nantiat,87,,,871030000F0151,,,,,,,,,,,,,0,,,,,T,terres,,,2320,1.172608,46.026135
2020-1263370,2020-05-26,000001,Vente,19344.76,,,LAS BOUENAS,B126,87140,87103,Nantiat,87,,,871030000F0162,,,,,,,,,,,,,0,,,,,T,terres,,,12780,1.167881,46.0233
2020-1263370,2020-05-26,000001,Vente,19344.76,,,BOIS DE LA GRANGE,B010,87140,87103,Nantiat,87,,,871030000F0174,,,,,,,,,,,,,0,,,,,T,terres,,,17190,1.16825,46.022187
2020-1263376,2020-05-26,000001,Vente,220,,,LE FROMENTEAU,B087,87140,87103,Nantiat,87,,,871030000F0210,,,,,,,,,,,,,0,,,,,T,terres,,,1082,1.164559,46.019368
2020-1263385,2020-05-29,000001,Vente,28000,12,,VILLECHENOUX,B227,87140,87103,Nantiat,87,,,87103000AV0121,,,,,,,,,,,,,0,1,Maison,45,2,S,sols,,,243,1.174721,46.022789
2020-1263847,2020-05-18,000001,Vente,100000,3,A,RTE DES ECOLIERS,0147,87140,87103,Nantiat,87,,,87103000AD0300,,,,,,,,,,,,,0,1,Maison,84,3,S,sols,,,500,1.178882,46.036074
2020-1263847,2020-05-18,000001,Vente,100000,3,A,RTE DES ECOLIERS,0147,87140,87103,Nantiat,87,,,87103000AD0300,,,,,,,,,,,,,0,1,Maison,84,3,P,prés,,,2536,1.178882,46.036074
2020-1264010,2020-06-18,000001,Vente,31000,,,LE GOT,B092,87140,87103,Nantiat,87,,,87103000AK0506,,,,,,,,,,,,,0,,,,,AB,terrains a bâtir,,,1322,1.178204,46.010435
2020-1264162,2020-06-10,000001,Vente,22000,6,,FREGEAIGUE,B086,87140,87103,Nantiat,87,,,87103000AI0070,,,,,,,,,,,,,0,1,Maison,90,3,S,sols,,,260,1.195342,46.014223
2020-1264162,2020-06-10,000001,Vente,22000,,,FREGEAIGUE,B086,87140,87103,Nantiat,87,,,87103000AI0072,,,,,,,,,,,,,0,,,,,J,jardins,,,1000,1.195553,46.014091
2020-1264261,2020-06-23,000001,Vente,45000,18,,RUE DE LA BRACONNE,0052,87140,87103,Nantiat,87,,,87103000AO0392,,,,,,,,,,,,,0,1,Maison,83,4,S,sols,,,856,1.171747,46.010231
2020-1264265,2020-06-25,000001,Vente,454358,,,LE BOURG OUEST,B022,87140,87103,Nantiat,87,,,87103000AO0185,,,,,,,,,,,,,0,,,,,S,sols,,,287,1.17505,46.010204
2020-1264265,2020-06-25,000001,Vente,454358,,,LE BOURG OUEST,B022,87140,87103,Nantiat,87,,,87103000AO0186,,,,,,,,,,,,,0,,,,,S,sols,,,15,1.1752,46.010153
2020-1264265,2020-06-25,000001,Vente,454358,19,,PL DE L EGLISE,0155,87140,87103,Nantiat,87,,,87103000AO0409,,,,,,,,,,,,,0,1,Maison,86,3,S,sols,,,343,1.175058,46.010109
2020-1264265,2020-06-25,000001,Vente,454358,19,,PL DE L EGLISE,0155,87140,87103,Nantiat,87,,,87103000AO0409,,,,,,,,,,,,,0,4,Local industriel. commercial ou assimilé,66,0,S,sols,,,343,1.175058,46.010109
2020-1264265,2020-06-25,000001,Vente,454358,19,,PL DE L EGLISE,0155,87140,87103,Nantiat,87,,,87103000AO0409,,,,,,,,,,,,,0,4,Local industriel. commercial ou assimilé,310,0,S,sols,,,343,1.175058,46.010109
2020-1264265,2020-06-25,000001,Vente,454358,19,,PL DE L EGLISE,0155,87140,87103,Nantiat,87,,,87103000AO0409,,,,,,,,,,,,,0,4,Local industriel. commercial ou assimilé,73,0,S,sols,,,343,1.175058,46.010109
2020-1264265,2020-06-25,000001,Vente,454358,,,LE BOURG OUEST,B022,87140,87103,Nantiat,87,,,87103000AO0410,,,,,,,,,,,,,0,,,,,S,sols,,,64,1.174976,46.010047
2020-1264265,2020-06-25,000001,Vente,454358,,,LE BOURG OUEST,B022,87140,87103,Nantiat,87,,,87103000AO0412,,,,,,,,,,,,,0,,,,,S,sols,,,66,1.175072,46.010001
2020-1264791,2020-07-09,000001,Vente,80000,1,,RUE MONTPLAISIR,0258,87140,87103,Nantiat,87,,,87103000AN0262,,,,,,,,,,,,,0,1,Maison,90,3,S,sols,,,653,1.177027,46.010015
2020-1264880,2020-07-16,000001,Vente,60000,,,PEU DEU SINGLARDS,B170,87140,87103,Nantiat,87,,,87103000AM0105,,,,,,,,,,,,,0,,,,,P,prés,,,1310,1.180553,45.989718
2020-1264880,2020-07-16,000001,Vente,60000,,,L AGE,B001,87140,87103,Nantiat,87,,,87103000AM0145,,,,,,,,,,,,,0,,,,,L,landes,,,38,1.177249,45.990679
2020-1264880,2020-07-16,000001,Vente,60000,,,LE BOUINOU,B018,87140,87103,Nantiat,87,,,87103000AM0182,,,,,,,,,,,,,0,,,,,B,bois,CHAT,Châtaigneraie,1193,1.181076,45.991095
2020-1264880,2020-07-16,000001,Vente,60000,,,LE BOUINOU,B018,87140,87103,Nantiat,87,,,87103000AM0188,,,,,,,,,,,,,0,,,,,BS,taillis sous futaie,,,688,1.182014,45.991726
2020-1264880,2020-07-16,000001,Vente,60000,6,,L AGE,B001,87140,87103,Nantiat,87,,,871030000D0085,,,,,,,,,,,,,0,1,Maison,82,3,S,sols,,,460,1.176809,45.990564
2020-1264880,2020-07-16,000001,Vente,60000,8,,L AGE,B001,87140,87103,Nantiat,87,,,871030000D0086,,,,,,,,,,,,,0,,,,,S,sols,,,258,1.176731,45.990465
2020-1264880,2020-07-16,000001,Vente,60000,,,LES COMMUNAUX,B046,87140,87103,Nantiat,87,,,871030000D0087,,,,,,,,,,,,,0,,,,,J,jardins,,,182,1.176657,45.990399
2020-1264880,2020-07-16,000001,Vente,60000,,,LES COMMUNAUX,B046,87140,87103,Nantiat,87,,,871030000D0088,,,,,,,,,,,,,0,,,,,P,prés,,,372,1.176646,45.990238
2020-1264880,2020-07-16,000001,Vente,60000,,,LES COMMUNAUX,B046,87140,87103,Nantiat,87,,,871030000D0314,,,,,,,,,,,,,0,,,,,T,terres,,,364,1.175649,45.990528
2020-1264880,2020-07-16,000001,Vente,60000,,,LES COMMUNAUX,B046,87140,87103,Nantiat,87,,,871030000D0369,,,,,,,,,,,,,0,,,,,P,prés,,,379,1.176581,45.990576
2020-1264880,2020-07-16,000001,Vente,60000,,,LES COMMUNAUX,B046,87140,87103,Nantiat,87,,,871030000D0371,,,,,,,,,,,,,0,,,,,P,prés,,,752,1.176476,45.990389
2020-1264986,2020-07-30,000001,Vente,100000,35,,RUE DU PUYPICHOT,0310,87140,87103,Nantiat,87,,,87103000AO0016,,,,,,,,,,,,,0,1,Maison,80,4,S,sols,,,480,1.169433,46.01331
2020-1264988,2020-07-16,000001,Vente,25000,9,,L AGE,B001,87140,87103,Nantiat,87,,,87103000AM0146,,,,,,,,,,,,,0,,,,,S,sols,,,160,1.177106,45.990724
2020-1264988,2020-07-16,000001,Vente,25000,,,L AGE,B001,87140,87103,Nantiat,87,,,87103000AM0147,,,,,,,,,,,,,0,,,,,J,jardins,,,180,1.176981,45.990792
2020-1265135,2020-08-04,000001,Vente,152700,46,,AV DE LA GARE,0180,87140,87103,Nantiat,87,,,87103000AT0236,,,,,,,,,,,,,0,1,Maison,103,4,S,sols,,,577,1.165067,46.008873
2020-1265135,2020-08-04,000001,Vente,152700,46,,AV DE LA GARE,0180,87140,87103,Nantiat,87,,,87103000AT0236,,,,,,,,,,,,,0,1,Maison,103,4,T,terres,,,1423,1.165067,46.008873
2020-1265469,2020-08-31,000001,Vente,160000,,,LAS TRANCHADAS,B137,87140,87103,Nantiat,87,,,87103000AT0131,,,,,,,,,,,,,0,,,,,J,jardins,,,825,1.16277,46.007841
2020-1265469,2020-08-31,000001,Vente,160000,60,,AV DE LA GARE,0180,87140,87103,Nantiat,87,,,87103000AT0132,,,,,,,,,,,,,0,1,Maison,209,8,S,sols,,,808,1.162886,46.007705
2020-1265499,2020-08-25,000001,Vente,2200,,,PEU DEU SINGLARDS,B170,87140,87103,Nantiat,87,,,87103000AM0109,,,,,,,,,,,,,0,,,,,BT,taillis simples,,,4140,1.182081,45.989327
2020-1265499,2020-08-25,000001,Vente,2200,,,PEU DEU SINGLARDS,B170,87140,87103,Nantiat,87,,,87103000AM0110,,,,,,,,,,,,,0,,,,,BR,futaies résineuses,,,13870,1.179119,45.988693
2020-1265499,2020-08-25,000001,Vente,2200,,,LE GROS CHENE,B112,87140,87103,Nantiat,87,,,871030000D0263,,,,,,,,,,,,,0,,,,,B,bois,CHAT,Châtaigneraie,637,1.176781,45.987946
2020-1265499,2020-08-25,000001,Vente,2200,,,PRE TORD,B190,87140,87103,Nantiat,87,,,871030000D0265,,,,,,,,,,,,,0,,,,,B,bois,CHAT,Châtaigneraie,1640,1.177259,45.988129
2020-1265653,2020-08-27,000001,Vente,127800,,,LEOBARDIE,B141,87140,87103,Nantiat,87,,,87103000AI0246,,,,,,,,,,,,,0,,,,,S,sols,,,159,1.191393,46.008572
2020-1265653,2020-08-27,000001,Vente,127800,19,,LEOBARDIE,B141,87140,87103,Nantiat,87,,,87103000AI0251,,,,,,,,,,,,,0,1,Maison,86,4,S,sols,,,500,1.1913,46.008325
2020-1265653,2020-08-27,000001,Vente,127800,19,,LEOBARDIE,B141,87140,87103,Nantiat,87,,,87103000AI0251,,,,,,,,,,,,,0,1,Maison,86,4,T,terres,,,1014,1.1913,46.008325
2020-1265694,2020-08-20,000001,Vente terrain à bâtir,3600,,,LA COUTURE,B052,87140,87103,Nantiat,87,,,87103000AM0396,,,,,,,,,,,,,0,,,,,AB,terrains a bâtir,,,3000,1.182558,46.004122
2020-1265738,2020-09-01,000001,Vente,150000,26,,RUE MONTPLAISIR,0258,87140,87103,Nantiat,87,,,87103000AN0081,,,,,,,,,,,,,0,4,Local industriel. commercial ou assimilé,560,0,S,sols,,,1836,1.17601,46.007564
2020-1265738,2020-09-01,000001,Vente,150000,26,,RUE MONTPLAISIR,0258,87140,87103,Nantiat,87,,,87103000AN0081,,,,,,,,,,,,,0,4,Local industriel. commercial ou assimilé,560,0,J,jardins,,,1219,1.17601,46.007564
2020-1265797,2020-09-08,000001,Vente,45000,32,,RUE DU PUYPICHOT,0310,87140,87103,Nantiat,87,,,87103000AO0415,,,,,,,,,,,,,0,1,Maison,67,3,S,sols,,,227,1.169745,46.012894
2020-1265797,2020-09-08,000001,Vente,45000,,,PUYPICHOT,B200,87140,87103,Nantiat,87,,,87103000AO0417,,,,,,,,,,,,,0,,,,,J,jardins,,,561,1.170153,46.012813
2020-1265876,2020-09-09,000002,Vente,154500,,,LE ROULE,B209,87140,87103,Nantiat,87,,,87103000AB0164,,,,,,,,,,,,,0,,,,,T,terres,,,750,1.166609,46.040218
2020-1265876,2020-09-09,000002,Vente,154500,7,,LE ROULE,B209,87140,87103,Nantiat,87,,,87103000AB0223,,,,,,,,,,,,,0,1,Maison,83,3,S,sols,,,538,1.166738,46.040156
2020-1265876,2020-09-09,000002,Vente,154500,,,LE ROULE,B209,87140,87103,Nantiat,87,,,87103000AB0226,,,,,,,,,,,,,0,,,,,T,terres,,,305,1.166724,46.039963
2020-1266101,2020-09-18,000001,Vente,155000,,,PEU DES RATS,B169,87140,87103,Nantiat,87,,,87103000AR0114,,,,,,,,,,,,,0,,,,,BT,taillis simples,,,594,1.164267,45.998171
2020-1266101,2020-09-18,000001,Vente,155000,,,PATURAL MICHEL,B162,87140,87103,Nantiat,87,,,871030000D0166,,,,,,,,,,,,,0,,,,,B,bois,CHAT,Châtaigneraie,1630,1.163482,45.994764
2020-1266101,2020-09-18,000001,Vente,155000,,,LES GOUTTES,B095,87140,87103,Nantiat,87,,,871030000E0012,,,,,,,,,,,,,0,,,,,T,terres,,,3300,1.155582,45.996145
2020-1266101,2020-09-18,000001,Vente,155000,,,MAISON ROUGE,B146,87140,87103,Nantiat,87,,,871030000E0046,,,,,,,,,,,,,0,,,,,P,prés,,,658,1.161294,45.993273
2020-1266101,2020-09-18,000001,Vente,155000,7,,MAISON ROUGE,B146,87140,87103,Nantiat,87,,,871030000E0047,,,,,,,,,,,,,0,1,Maison,100,4,S,sols,,,529,1.161006,45.993396
2020-1266101,2020-09-18,000001,Vente,155000,5806,C,MAISON ROUGE,B146,87140,87103,Nantiat,87,,,871030000E0148,,,,,,,,,,,,,0,3,Dépendance,,0,T,terres,,,1692,1.161248,45.993496
2020-1266652,2020-09-24,000001,Vente,62500,1,,RUE DE LA BORIE,0040,87140,87103,Nantiat,87,,,87103000AO0158,,,,,,,,,,,,,0,3,Dépendance,,0,S,sols,,,127,1.174648,46.011217
2020-1266652,2020-09-24,000001,Vente,62500,1,,RUE DE LA BORIE,0040,87140,87103,Nantiat,87,,,87103000AO0158,,,,,,,,,,,,,0,2,Appartement,94,4,S,sols,,,127,1.174648,46.011217
2020-1266652,2020-09-24,000001,Vente,62500,1,,RUE DE LA BORIE,0040,87140,87103,Nantiat,87,,,87103000AO0158,,,,,,,,,,,,,0,2,Appartement,40,2,S,sols,,,127,1.174648,46.011217
2020-1266652,2020-09-24,000001,Vente,62500,1,,RUE DE LA BORIE,0040,87140,87103,Nantiat,87,,,87103000AO0158,,,,,,,,,,,,,0,3,Dépendance,,0,S,sols,,,127,1.174648,46.011217
2020-1266652,2020-09-24,000001,Vente,62500,1,,RUE DE LA BORIE,0040,87140,87103,Nantiat,87,,,87103000AO0158,,,,,,,,,,,,,0,2,Appartement,36,2,S,sols,,,127,1.174648,46.011217