id_mutation,date_mutation,numero_disposition,nature_mutation,valeur_fonciere,adresse_numero,adresse_suffixe,adresse_nom_voie,adresse_code_voie,code_postal,code_commune,nom_commune,code_departement,ancien_code_commune,ancien_nom_commune,id_parcelle,ancien_id_parcelle,numero_volume,lot1_numero,lot1_surface_carrez,lot2_numero,lot2_surface_carrez,lot3_numero,lot3_surface_carrez,lot4_numero,lot4_surface_carrez,lot5_numero,lot5_surface_carrez,nombre_lots,code_type_local,type_local,surface_reelle_bati,nombre_pieces_principales,code_nature_culture,nature_culture,code_nature_culture_speciale,nature_culture_speciale,surface_terrain,longitude,latitude
2020-1271678,2020-07-01,000001,Vente,2300,,,LE HAUT DU CHANE,B042,88320,88199,Gignéville,88,,,881990000A0095,,,,,,,,,,,,,0,,,,,BT,taillis simples,,,1400,5.913836,48.116639
2020-1271678,2020-07-01,000001,Vente,2300,,,LE VOI DU CHAMP,B070,88320,88199,Gignéville,88,,,881990000A0160,,,,,,,,,,,,,0,,,,,BR,futaies résineuses,,,360,5.912992,48.113156
2020-1271678,2020-07-01,000001,Vente,2300,,,LES VIEILLES VIGNES,B067,88320,88199,Gignéville,88,,,881990000A0589,,,,,,,,,,,,,0,,,,,P,prés,,,2300,5.918019,48.114964
2020-1271678,2020-07-01,000001,Vente,2300,,,LES VIEILLES VIGNES,B067,88320,88199,Gignéville,88,,,881990000A0646,,,,,,,,,,,,,0,,,,,P,prés,,,723,5.917323,48.114677
2020-1271678,2020-07-01,000001,Vente,2300,,,LES VIEILLES VIGNES,B067,88320,88199,Gignéville,88,,,881990000A0681,,,,,,,,,,,,,0,,,,,P,prés,,,18383,5.917503,48.115913
2020-1272354,2020-08-28,000001,Vente,121000,,,LE VILLAGE,B069,88320,88199,Gignéville,88,,,88199000AB0012,,,,,,,,,,,,,0,,,,,VE,vergers,,,941,5.911515,48.107325
2020-1272354,2020-08-28,000001,Vente,121000,1,,RUE GRANDE RUE,0023,88320,88199,Gignéville,88,,,88199000AB0013,,,,,,,,,,,,,0,1,Maison,141,5,S,sols,,,664,5.911949,48.107574
2020-1273105,2020-09-24,000001,Vente,1550,,,LES CHASEAUX,B019,88320,88199,Gignéville,88,,,88199000AB0154,,,,,,,,,,,,,0,,,,,VE,vergers,,,2582,5.911746,48.107023
