id_mutation,date_mutation,numero_disposition,nature_mutation,valeur_fonciere,adresse_numero,adresse_suffixe,adresse_nom_voie,adresse_code_voie,code_postal,code_commune,nom_commune,code_departement,ancien_code_commune,ancien_nom_commune,id_parcelle,ancien_id_parcelle,numero_volume,lot1_numero,lot1_surface_carrez,lot2_numero,lot2_surface_carrez,lot3_numero,lot3_surface_carrez,lot4_numero,lot4_surface_carrez,lot5_numero,lot5_surface_carrez,nombre_lots,code_type_local,type_local,surface_reelle_bati,nombre_pieces_principales,code_nature_culture,nature_culture,code_nature_culture_speciale,nature_culture_speciale,surface_terrain,longitude,latitude
2020-1269703,2020-01-07,000001,Vente,700,,,SOUS LE BOIS BANAL,B200,88320,88258,Lamarche,88,,,882580000C0240,,,,,,,,,,,,,0,,,,,BT,taillis simples,,,1590,5.768401,48.055589
2020-1269703,2020-01-07,000001,Vente,700,,,SOUS LE BOIS BANAL,B200,88320,88258,Lamarche,88,,,882580000C0254,,,,,,,,,,,,,0,,,,,L,landes,FRICH,Friche,444,5.769706,48.055273
2020-1269787,2020-01-17,000001,Vente,900,,,LE HAUT DE COTE DES FOURCH,B101,88320,88258,Lamarche,88,,,882580000B0229,,,,,,,,,,,,,0,,,,,BT,taillis simples,,,1900,5.804326,48.074117
2020-1269787,2020-01-17,000001,Vente,900,,,SOUS LE BOIS BANAL,B200,88320,88258,Lamarche,88,,,882580000C0259,,,,,,,,,,,,,0,,,,,BT,taillis simples,,,460,5.767444,48.055164
2020-1269827,2020-01-22,000001,Vente,15000,,,LES PREMIERES VAUX,B149,88320,88258,Lamarche,88,,,88258000ZC0041,,,,,,,,,,,,,0,,,,,P,prés,,,52694,5.799483,48.06309
2020-1270169,2020-02-12,000001,Vente,5300,,,REVERS DE LA COTE,B163,88320,88258,Lamarche,88,,,882580000B0149,,,,,,,,,,,,,0,,,,,BT,taillis simples,,,1920,5.808158,48.074663
2020-1270169,2020-02-12,000001,Vente,5300,,,AU PRE TRONCHOT,B148,88320,88258,Lamarche,88,,,882580000B0785,,,,,,,,,,,,,0,,,,,BR,futaies résineuses,,,1965,5.809322,48.068137
2020-1270169,2020-02-12,000001,Vente,5300,,,AUX ROISES PRES DE L EFFUT,B168,88320,88258,Lamarche,88,,,882580000C1759,,,,,,,,,,,,,0,,,,,BT,taillis simples,,,1560,5.799553,48.048605
2020-1270169,2020-02-12,000001,Vente,5300,,,PRE ERARD,B139,88320,88258,Lamarche,88,,,882580000F0180,,,,,,,,,,,,,0,,,,,BT,taillis simples,,,2090,5.757294,48.07755
2020-1270170,2020-02-12,000001,Vente,4000,,,A LA COUTELOTTE,B045,88320,88258,Lamarche,88,,,88258000ZH0032,,,,,,,,,,,,,0,,,,,P,prés,,,12740,5.802297,48.057238
2020-1270394,2020-03-04,000001,Vente,126000,13,,RUE SAINT JOSEPH,0380,88320,88258,Lamarche,88,,,88258000ZC0020,,,,,,,,,,,,,0,1,Maison,97,5,P,prés,,,29501,5.790757,48.065705
2020-1270394,2020-03-04,000001,Vente,126000,13,,RUE SAINT JOSEPH,0380,88320,88258,Lamarche,88,,,88258000ZC0020,,,,,,,,,,,,,0,1,Maison,97,5,S,sols,,,2139,5.790757,48.065705
2020-1270431,2020-02-18,000001,Vente,55000,,,RELENTARDE,B162,88320,88258,Lamarche,88,,,882580000C2112,,,,,,,,,,,,,0,,,,,VE,vergers,,,720,5.788942,48.066245
2020-1270431,2020-02-18,000001,Vente,55000,,,RELENTARDE,B162,88320,88258,Lamarche,88,,,882580000C2113,,,,,,,,,,,,,0,,,,,VE,vergers,,,1303,5.789255,48.066222
2020-1270431,2020-02-18,000001,Vente,55000,11,,RUE SAINT JOSEPH,0380,88320,88258,Lamarche,88,,,882580000C2114,,,,,,,,,,,,,0,1,Maison,70,4,S,sols,,,720,5.789234,48.066022
2020-1270431,2020-02-18,000001,Vente,55000,,,RELENTARDE,B162,88320,88258,Lamarche,88,,,882580000C2115,,,,,,,,,,,,,0,,,,,T,terres,,,975,5.789643,48.065936
2020-1270577,2020-03-10,000001,Vente,15000,1,,RUE DE BELLUNE,0040,88320,88258,Lamarche,88,,,882580000G0876,,,,,,,,,,,,,0,4,Local industriel. commercial ou assimilé,360,0,S,sols,,,420,5.780987,48.070532
2020-1270995,2020-05-23,000001,Vente,82950,,,AVENUE DE LA GARE,B002,88320,88258,Lamarche,88,,,882580000G1149,,,,,,,,,,,,,0,,,,,S,sols,,,488,5.780014,48.071088
2020-1271562,2020-07-01,000001,Vente,20000,4,,AV DES TILLEULS,0440,88320,88258,Lamarche,88,,,882580000G1156,,,,,,,,,,,,,0,1,Maison,163,6,S,sols,,,400,5.778616,48.068339
2020-1271853,2020-07-22,000001,Vente,4500,,,PAQUIS DE LA CROIX,B121,88320,88258,Lamarche,88,,,882580000G0914,,,,,,,,,,,,,0,,,,,P,prés,,,680,5.786038,48.073565
2020-1271853,2020-07-22,000001,Vente,4500,,,PAQUIS DE LA CROIX,B121,88320,88258,Lamarche,88,,,882580000G0915,,,,,,,,,,,,,0,,,,,S,sols,,,57,5.785934,48.073553
2020-1272182,2020-08-18,000001,Vente,107000,,,RUE DU COLONEL RENARD,B181,88320,88258,Lamarche,88,,,882580000G0701,,,,,,,,,,,,,0,,,,,J,jardins,,,1006,5.782735,48.068463
2020-1272182,2020-08-18,000001,Vente,107000,33,,RUE DU COLONEL RENARD,0140,88320,88258,Lamarche,88,,,882580000G1077,,,,,,,,,,,,,0,1,Maison,160,7,S,sols,,,360,5.782329,48.068535
2020-1272182,2020-08-18,000001,Vente,107000,,,RUE DU COLONEL RENARD,B181,88320,88258,Lamarche,88,,,882580000G1078,,,,,,,,,,,,,0,,,,,S,sols,,,72,5.782923,48.068623
2020-1272182,2020-08-18,000001,Vente,107000,,,RUE DU COLONEL RENARD,B181,88320,88258,Lamarche,88,,,882580000G1079,,,,,,,,,,,,,0,,,,,S,sols,,,12,5.782641,48.068511
2020-1272213,2020-08-05,000001,Vente,75000,7,,RUE DE LA CRX DE MISSION,0150,88320,88258,Lamarche,88,,,88258000ZH0111,,,,,,,,,,,,,0,1,Maison,87,4,S,sols,,,973,5.784015,48.064477
2020-1272295,2020-08-25,000001,Vente,7100,3,,RUE SAINT NICOLAS,0451,88320,88258,Lamarche,88,,,882580000G0080,,,,,,,,,,,,,0,1,Maison,63,2,S,sols,,,57,5.782448,48.071869
2020-1272297,2020-08-26,000001,Vente,8000,,,LES VIGNES DU FEUMEROT,B222,88320,88258,Lamarche,88,,,882580000B0568,,,,,,,,,,,,,0,,,,,BT,taillis simples,,,970,5.795847,48.070205
2020-1272297,2020-08-26,000001,Vente,8000,,,LES VIGNES DU FEUMEROT,B222,88320,88258,Lamarche,88,,,882580000B0569,,,,,,,,,,,,,0,,,,,L,landes,FRICH,Friche,1700,5.795161,48.069717
2020-1272297,2020-08-26,000001,Vente,8000,,,AU PRE TRONCHOT,B148,88320,88258,Lamarche,88,,,882580000B0779,,,,,,,,,,,,,0,,,,,BS,taillis sous futaie,,,4200,5.810644,48.067778
2020-1272297,2020-08-26,000001,Vente,8000,,,REVERS DE LA ROMAINE,B164,88320,88258,Lamarche,88,,,882580000F0147,,,,,,,,,,,,,0,,,,,L,landes,FRICH,Friche,4890,5.756567,48.075742
2020-1272297,2020-08-26,000001,Vente,8000,,,REVERS DE LA ROMAINE,B164,88320,88258,Lamarche,88,,,882580000F0150,,,,,,,,,,,,,0,,,,,L,landes,FRICH,Friche,3820,5.757585,48.075177
2020-1272297,2020-08-26,000001,Vente,8000,,,REVERS DE LA ROMAINE,B164,88320,88258,Lamarche,88,,,882580000F0161,,,,,,,,,,,,,0,,,,,BT,taillis simples,,,2470,5.754702,48.075168
2020-1272436,2020-09-02,000001,Vente,2000,,,A LA CROSSENADE,B048,88320,88258,Lamarche,88,,,882580000B0202,,,,,,,,,,,,,0,,,,,L,landes,FRICH,Friche,1560,5.810823,48.071424
2020-1272436,2020-09-02,000001,Vente,2000,,,A LA CROSSENADE,B048,88320,88258,Lamarche,88,,,882580000B0203,,,,,,,,,,,,,0,,,,,BT,taillis simples,,,520,5.809563,48.07177
2020-1272436,2020-09-02,000001,Vente,2000,,,A LA CROSSENADE,B048,88320,88258,Lamarche,88,,,882580000B0206,,,,,,,,,,,,,0,,,,,L,landes,FRICH,Friche,1355,5.810477,48.071609
2020-1272436,2020-09-02,000001,Vente,2000,,,L OLIVETTE,B120,88320,88258,Lamarche,88,,,882580000C0169,,,,,,,,,,,,,0,,,,,BS,taillis sous futaie,,,2520,5.757399,48.056809
2020-1272436,2020-09-02,000001,Vente,2000,,,TRAVIOT,B212,88320,88258,Lamarche,88,,,882580000F0011,,,,,,,,,,,,,0,,,,,L,landes,FRICH,Friche,1710,5.755312,48.079261
2020-1272779,2020-09-25,000001,Vente,600,,,AUX ROISES,B167,88320,88258,Lamarche,88,,,882580000E0099,,,,,,,,,,,,,0,,,,,BT,taillis simples,,,1210,5.767699,48.046394
2020-1272781,2020-09-25,000001,Vente,180,,,AUX ROISES,B167,88320,88258,Lamarche,88,,,882580000E0092,,,,,,,,,,,,,0,,,,,BT,taillis simples,,,715,5.769036,48.047016
2020-1272830,2020-09-25,000001,Vente,680,,,SOUS LE BOIS BANAL,B200,88320,88258,Lamarche,88,,,882580000C0279,,,,,,,,,,,,,0,,,,,L,landes,FRICH,Friche,730,5.770456,48.054001
2020-1272830,2020-09-25,000001,Vente,680,,,A LA PUJELOTTE,B157,88320,88258,Lamarche,88,,,882580000C0362,,,,,,,,,,,,,0,,,,,L,landes,FRICH,Friche,1340,5.766428,48.053497
2020-1272830,2020-09-25,000001,Vente,680,,,A LA PUJELOTTE,B157,88320,88258,Lamarche,88,,,882580000C0373,,,,,,,,,,,,,0,,,,,L,landes,FRICH,Friche,855,5.765637,48.052867
2020-1273101,2020-10-06,000001,Vente,36000,10,,CHERI BUISSON,B025,88320,88258,Lamarche,88,,,88258000ZB0209,,,,,,,,,,,,,0,4,Local industriel. commercial ou assimilé,300,0,S,sols,,,2387,5.790638,48.075626
2020-1273101,2020-10-06,000001,Vente,36000,,,CHERI BUISSON,B025,88320,88258,Lamarche,88,,,88258000ZB0211,,,,,,,,,,,,,0,,,,,P,prés,,,882,5.790529,48.075737
2020-1273357,2020-10-21,000001,Vente,900,,,AU PLAN DE POUREAU,B130,88320,88258,Lamarche,88,,,882580000G0651,,,,,,,,,,,,,0,,,,,J,jardins,,,570,5.778471,48.072715
2020-1273362,2020-10-21,000001,Vente,29690,,,LES PREMIERES VAUX,B149,88320,88258,Lamarche,88,,,88258000ZC0013,,,,,,,,,,,,,0,,,,,T,terres,,,49300,5.79578,48.064495
2020-1273362,2020-10-21,000001,Vente,29690,,,LES PREMIERES VAUX,B149,88320,88258,Lamarche,88,,,88258000ZC0013,,,,,,,,,,,,,0,,,,,T,terres,,,24650,5.79578,48.064495
2020-1273362,2020-10-21,000001,Vente,29690,,,LES PREMIERES VAUX,B149,88320,88258,Lamarche,88,,,88258000ZC0037,,,,,,,,,,,,,0,,,,,P,prés,,,12500,5.798101,48.064287
2020-1273362,2020-10-21,000001,Vente,29690,,,LES PREMIERES VAUX,B149,88320,88258,Lamarche,88,,,88258000ZC0037,,,,,,,,,,,,,0,,,,,P,prés,,,12500,5.798101,48.064287
2020-1273588,2020-11-02,000001,Vente,18000,6,,RUE GAMBETTA,0210,88320,88258,Lamarche,88,,,882580000G0491,,,,,,,,,,,,,0,1,Maison,90,3,S,sols,,,404,5.781466,48.066956
2020-1273790,2020-10-21,000001,Vente,16000,,,LA CORVEE DES TRINITAIRES,B035,88320,88258,Lamarche,88,,,882580000B0153,,,,,,,,,,,,,0,,,,,L,landes,FRICH,Friche,990,5.810048,48.073311
2020-1273790,2020-10-21,000001,Vente,16000,,,LA CORVEE DES TRINITAIRES,B035,88320,88258,Lamarche,88,,,882580000B0154,,,,,,,,,,,,,0,,,,,BR,futaies résineuses,,,590,5.810116,48.073156
2020-1273790,2020-10-21,000001,Vente,16000,,,LA CORVEE DES TRINITAIRES,B035,88320,88258,Lamarche,88,,,882580000B0155,,,,,,,,,,,,,0,,,,,L,landes,FRICH,Friche,760,5.809628,48.073291
2020-1273833,2020-11-25,000001,Vente,19000,5000,,RUE DE RAPPECHAMPS,0454,88320,88258,Lamarche,88,,,882580000D0014,,,,,,,,,,,,,0,3,Dépendance,,0,S,sols,,,137,5.786155,48.058347
2020-1273833,2020-11-25,000001,Vente,19000,,,LA GRANDE RUE,B094,88320,88258,Lamarche,88,,,88258000ZH0082,,,,,,,,,,,,,0,,,,,P,prés,,,740,5.785913,48.058548
2020-1274021,2020-12-10,000001,Vente,63000,35,,RUE DE BELLUNE,0040,88320,88258,Lamarche,88,,,882580000G0490,,,,,,,,,,,,,0,1,Maison,106,6,S,sols,,,156,5.781475,48.066859
2020-1274021,2020-12-10,000001,Vente,63000,,,CHAMP BRICARD,B015,88320,88258,Lamarche,88,,,882580000G0722,,,,,,,,,,,,,0,,,,,T,terres,,,70,5.781439,48.066795
2020-1274021,2020-12-10,000001,Vente,63000,,,CHAMP BRICARD,B015,88320,88258,Lamarche,88,,,882580000G0877,,,,,,,,,,,,,0,,,,,S,sols,,,27,5.781316,48.066932
2020-1274021,2020-12-10,000001,Vente,63000,,,CHAMP BRICARD,B015,88320,88258,Lamarche,88,,,882580000G0945,,,,,,,,,,,,,0,,,,,T,terres,,,1211,5.781707,48.066612
2020-1274021,2020-12-10,000001,Vente,63000,,,CHAMP BRICARD,B015,88320,88258,Lamarche,88,,,882580000G0947,,,,,,,,,,,,,0,,,,,T,terres,,,445,5.781661,48.066808
2020-1274437,2020-12-23,000001,Vente,13000,,,RUE SAINT HENRY,B189,88320,88258,Lamarche,88,,,882580000G0729,,,,,,,,,,,,,0,,,,,S,sols,,,198,5.781572,48.0712
2020-1274445,2020-12-23,000001,Vente,3000,5,,RUE SAINT LOUIS,0400,88320,88258,Lamarche,88,,,882580000G1039,,,,,,,,,,,,,0,1,Maison,70,2,S,sols,,,273,,
