id_mutation,date_mutation,numero_disposition,nature_mutation,valeur_fonciere,adresse_numero,adresse_suffixe,adresse_nom_voie,adresse_code_voie,code_postal,code_commune,nom_commune,code_departement,ancien_code_commune,ancien_nom_commune,id_parcelle,ancien_id_parcelle,numero_volume,lot1_numero,lot1_surface_carrez,lot2_numero,lot2_surface_carrez,lot3_numero,lot3_surface_carrez,lot4_numero,lot4_surface_carrez,lot5_numero,lot5_surface_carrez,nombre_lots,code_type_local,type_local,surface_reelle_bati,nombre_pieces_principales,code_nature_culture,nature_culture,code_nature_culture_speciale,nature_culture_speciale,surface_terrain,longitude,latitude
2020-1270263,2020-02-12,000001,Vente,6000,,,LE PAQUIS VIOLET,B034,88800,88309,Monthureux-le-Sec,88,,,88309000ZD0014,,,,,,,,,,,,,0,,,,,P,prés,,,6660,6.028234,48.176044
2020-1270700,2020-03-16,000001,Vente,1800,,,LE PAQUIS VIOLET,B034,88800,88309,Monthureux-le-Sec,88,,,88309000ZD0012,,,,,,,,,,,,,0,,,,,VE,vergers,,,4740,6.029175,48.17632
2020-1270700,2020-03-16,000002,Vente,1800,,,LE PAQUIS VIOLET,B034,88800,88309,Monthureux-le-Sec,88,,,88309000ZD0012,,,,,,,,,,,,,0,,,,,VE,vergers,,,4740,6.029175,48.17632
2020-1271082,2020-05-07,000001,Vente,170000,,,LE VILLAGE,B055,88800,88309,Monthureux-le-Sec,88,,,883090000B0340,,,,,,,,,,,,,0,,,,,J,jardins,,,571,6.024905,48.168777
2020-1271082,2020-05-07,000001,Vente,170000,,,LE VILLAGE,B055,88800,88309,Monthureux-le-Sec,88,,,883090000B0343,,,,,,,,,,,,,0,,,,,AG,terrains d'agrément,,,1699,6.025676,48.16942
2020-1271082,2020-05-07,000001,Vente,170000,70,,RTE D ESLEY,0012,88800,88309,Monthureux-le-Sec,88,,,883090000B0344,,,,,,,,,,,,,0,1,Maison,225,6,S,sols,,,627,6.025613,48.169517
2020-1271082,2020-05-07,000001,Vente,170000,,,LE VILLAGE,B055,88800,88309,Monthureux-le-Sec,88,,,883090000B0729,,,,,,,,,,,,,0,,,,,VE,vergers,,,3016,6.025356,48.168917
2020-1271082,2020-05-07,000001,Vente,170000,,,PATIS DU CHANAU,B035,88800,88309,Monthureux-le-Sec,88,,,88309000ZH0047,,,,,,,,,,,,,0,,,,,T,terres,,,877,6.023094,48.160984
2020-1271264,2020-05-26,000001,Vente,41813.77,,,LA QUENOUILLE,B043,88800,88309,Monthureux-le-Sec,88,,,88309000ZK0035,,,,,,,,,,,,,0,,,,,P,prés,,,17500,6.010635,48.177448
2020-1271264,2020-05-26,000001,Vente,41813.77,,,LA QUENOUILLE,B043,88800,88309,Monthureux-le-Sec,88,,,88309000ZK0035,,,,,,,,,,,,,0,,,,,P,prés,,,17500,6.010635,48.177448
2020-1271264,2020-05-26,000001,Vente,41813.77,,,LA QUENOUILLE,B043,88800,88309,Monthureux-le-Sec,88,,,88309000ZK0036,,,,,,,,,,,,,0,,,,,P,prés,,,31663,6.009694,48.176402
2020-1271264,2020-05-26,000001,Vente,41813.77,,,LA QUENOUILLE,B043,88800,88309,Monthureux-le-Sec,88,,,88309000ZK0036,,,,,,,,,,,,,0,,,,,P,prés,,,31663,6.009694,48.176402
2020-1271416,2020-05-29,000001,Vente,2000,,,CORBEY,B011,88800,88309,Monthureux-le-Sec,88,,,883090000C0115,,,,,,,,,,,,,0,,,,,VE,vergers,,,1266,6.020526,48.166202
2020-1271416,2020-05-29,000001,Vente,2000,,,CORBEY,B011,88800,88309,Monthureux-le-Sec,88,,,883090000C0116,,,,,,,,,,,,,0,,,,,VE,vergers,,,5056,6.02081,48.166304
2020-1271814,2020-06-24,000001,Vente,1062,,,LES SAUSSOTTES,B051,88800,88309,Monthureux-le-Sec,88,,,88309000ZB0017,,,,,,,,,,,,,0,,,,,T,terres,,,2360,6.023936,48.186771
2020-1273313,2020-10-07,000001,Vente,420000,101,,RUE GRANDE RUE,0029,88800,88309,Monthureux-le-Sec,88,,,883090000B0731,,,,,,,,,,,,,0,1,Maison,448,13,S,sols,,,1602,6.025406,48.170929
2020-1273313,2020-10-07,000001,Vente,420000,,,LE VILLAGE,B055,88800,88309,Monthureux-le-Sec,88,,,883090000B0732,,,,,,,,,,,,,0,,,,,S,sols,,,93,6.024747,48.171324
2020-1273313,2020-10-07,000001,Vente,420000,,,LE VILLAGE,B055,88800,88309,Monthureux-le-Sec,88,,,883090000B0761,,,,,,,,,,,,,0,,,,,VE,vergers,,,4849,6.024381,48.171009
2020-1273313,2020-10-07,000001,Vente,420000,,,LE VILLAGE,B055,88800,88309,Monthureux-le-Sec,88,,,883090000B0761,,,,,,,,,,,,,0,,,,,AG,terrains d'agrément,,,2000,6.024381,48.171009
2020-1273313,2020-10-07,000001,Vente,420000,,,LE VILLAGE,B055,88800,88309,Monthureux-le-Sec,88,,,883090000B0761,,,,,,,,,,,,,0,,,,,P,prés,,,2104,6.024381,48.171009
2020-1273313,2020-10-07,000001,Vente,420000,,,LE VILLAGE,B055,88800,88309,Monthureux-le-Sec,88,,,883090000B0761,,,,,,,,,,,,,0,,,,,BR,futaies résineuses,,,6000,6.024381,48.171009
