id_mutation,date_mutation,numero_disposition,nature_mutation,valeur_fonciere,adresse_numero,adresse_suffixe,adresse_nom_voie,adresse_code_voie,code_postal,code_commune,nom_commune,code_departement,ancien_code_commune,ancien_nom_commune,id_parcelle,ancien_id_parcelle,numero_volume,lot1_numero,lot1_surface_carrez,lot2_numero,lot2_surface_carrez,lot3_numero,lot3_surface_carrez,lot4_numero,lot4_surface_carrez,lot5_numero,lot5_surface_carrez,nombre_lots,code_type_local,type_local,surface_reelle_bati,nombre_pieces_principales,code_nature_culture,nature_culture,code_nature_culture_speciale,nature_culture_speciale,surface_terrain,longitude,latitude
2020-1277348,2020-01-07,000001,Vente,64000,7,,RTE DE LA PRELE,0110,88120,88462,Le Syndicat,88,,,88462000AK0020,,,,,,,,,,,,,0,1,Maison,120,4,S,sols,,,1160,6.681324,48.036236
2020-1277348,2020-01-07,000001,Vente,64000,,,AUX MURS,B158,88120,88462,Le Syndicat,88,,,88462000AK0023,,,,,,,,,,,,,0,,,,,S,sols,,,400,6.681488,48.036144
2020-1277462,2020-02-18,000001,Vente,178000,,,AU BRAON,B028,88120,88462,Le Syndicat,88,,,88462000AM0304,,,,,,,,,,,,,0,,,,,S,sols,,,68,6.671534,48.0143
2020-1277462,2020-02-18,000001,Vente,178000,9,,RTE DU BREAU,0021,88120,88462,Le Syndicat,88,,,88462000AM0500,,,,,,,,,,,,,0,1,Maison,218,7,P,prés,,,2044,6.672024,48.014203
2020-1277462,2020-02-18,000001,Vente,178000,9,,RTE DU BREAU,0021,88120,88462,Le Syndicat,88,,,88462000AM0500,,,,,,,,,,,,,0,1,Maison,218,7,S,sols,,,500,6.672024,48.014203
2020-1277462,2020-02-18,000001,Vente,178000,,,AU BRAON,B028,88120,88462,Le Syndicat,88,,,88462000AM0536,,,,,,,,,,,,,0,,,,,S,sols,,,21,6.671547,48.014354
2020-1277508,2020-02-11,000001,Vente,2454,,,LE PRE CLAUDOT,B186,88120,88462,Le Syndicat,88,,,88462000AC0029,,,,,,,,,,,,,0,,,,,BR,futaies résineuses,,,7010,6.729732,48.055974
2020-1277524,2020-02-17,000001,Vente,129050,,,LA CHENEAU,B054,88120,88462,Le Syndicat,88,,,88462000AL0286,,,,,,,,,,,,,0,,,,,T,terres,,,335,6.686927,48.024638
2020-1277524,2020-02-17,000001,Vente,129050,16,,RTE DE BREHAVILLERS,0022,88120,88462,Le Syndicat,88,,,88462000AL0469,,,,,,,,,,,,,0,1,Maison,113,6,S,sols,,,875,6.687266,48.024764
2020-1277603,2020-02-14,000001,Vente,60000,,,BADONFAING,B009,88120,88462,Le Syndicat,88,,,88462000AN0202,,,,,,,,,,,,,0,,,,,BT,taillis simples,,,1116,6.683143,48.015812
2020-1277812,2020-05-28,000001,Vente,232320,15,,BADONFAING,B009,88120,88462,Le Syndicat,88,,,88462000AN0208,,,,,,,,,,,,,0,1,Maison,166,7,BT,taillis simples,,,943,6.68245,48.015917
2020-1277842,2020-06-09,000001,Vente,94000,,,SOUS LE PRE TONNERRE,B248,88120,88462,Le Syndicat,88,,,88462000AH0025,,,,,,,,,,,,,0,,,,,BT,taillis simples,,,1550,6.692923,48.050759
2020-1277842,2020-06-09,000001,Vente,94000,,,SOUS LE PRE TONNERRE,B248,88120,88462,Le Syndicat,88,,,88462000AH0026,,,,,,,,,,,,,0,,,,,T,terres,,,540,6.692215,48.050645
2020-1277842,2020-06-09,000001,Vente,94000,1,,CHE XAVIER THIRIAT,0160,88120,88462,Le Syndicat,88,,,88462000AH0027,,,,,,,,,,,,,0,1,Maison,67,4,S,sols,,,1080,6.691878,48.05054
2020-1277842,2020-06-09,000001,Vente,94000,,,SOUS LE PRE TONNERRE,B248,88120,88462,Le Syndicat,88,,,88462000AH0166,,,,,,,,,,,,,0,,,,,P,prés,,,6967,6.691982,48.050625
2020-1277842,2020-06-09,000001,Vente,94000,,,SOUS LE PRE TONNERRE,B248,88120,88462,Le Syndicat,88,,,88462000AH0166,,,,,,,,,,,,,0,,,,,E,eaux,CANAL,Canal,300,6.691982,48.050625
2020-1277879,2020-06-10,000001,Vente,20000,5,B,RTE DES ROCASSES,0123,88120,88462,Le Syndicat,88,,,88462000AP0023,,,,,,,,,,,,,0,2,Appartement,70,5,S,sols,,,1441,6.700371,48.009303
2020-1277879,2020-06-10,000001,Vente,20000,5,B,RTE DES ROCASSES,0123,88120,88462,Le Syndicat,88,,,88462000AP0023,,,,,,,,,,,,,0,2,Appartement,40,3,S,sols,,,1441,6.700371,48.009303
2020-1277879,2020-06-10,000001,Vente,20000,,,LE GRAVIER,B110,88120,88462,Le Syndicat,88,,,88462000AP0128,,,,,,,,,,,,,0,,,,,S,sols,,,970,6.700612,48.009271
2020-1277879,2020-06-10,000001,Vente,20000,,,LE GRAVIER,B110,88120,88462,Le Syndicat,88,,,88462000AP0130,,,,,,,,,,,,,0,,,,,S,sols,,,155,6.7008,48.009458
2020-1277880,2020-06-10,000001,Vente,4000,,,LE GRAVIER,B110,88120,88462,Le Syndicat,88,,,88462000AP0129,,,,,,,,,,,,,0,,,,,S,sols,,,335,6.701288,48.009645
2020-1277880,2020-06-10,000001,Vente,4000,,,LE GRAVIER,B110,88120,88462,Le Syndicat,88,,,88462000AP0131,,,,,,,,,,,,,0,,,,,S,sols,,,79,6.701223,48.009581
2020-1277941,2020-06-02,000001,Vente,10000,,,BADONFAING,B009,88120,88462,Le Syndicat,88,,,88462000AN0053,,,,,,,,,,,,,0,,,,,S,sols,,,640,6.681748,48.014258
2020-1277941,2020-06-02,000001,Vente,10000,,,BADONFAING,B009,88120,88462,Le Syndicat,88,,,88462000AN0054,,,,,,,,,,,,,0,,,,,P,prés,,,3960,6.681837,48.01443
2020-1277941,2020-06-02,000001,Vente,10000,,,BADONFAING,B009,88120,88462,Le Syndicat,88,,,88462000AN0055,,,,,,,,,,,,,0,,,,,P,prés,,,3990,6.681388,48.01487
2020-1277947,2020-06-22,000001,Vente,55000,,,LE BON PRE,B026,88120,88462,Le Syndicat,88,,,88462000AK0287,,,,,,,,,,,,,0,,,,,BM,futaies mixtes,,,4720,,
2020-1277947,2020-06-22,000001,Vente,55000,,,LE BON PRE,B026,88120,88462,Le Syndicat,88,,,88462000AK1175,,,,,,,,,,,,,0,,,,,P,prés,,,2324,6.67783,48.030717
2020-1277947,2020-06-22,000001,Vente,55000,,,LE BON PRE,B026,88120,88462,Le Syndicat,88,,,88462000AK1175,,,,,,,,,,,,,0,,,,,P,prés,,,2324,6.67783,48.030717
2020-1277967,2020-06-30,000001,Vente,310000,,,AU CHASAL,B051,88120,88462,Le Syndicat,88,,,88462000AM0340,,,,,,,,,,,,,0,,,,,S,sols,,,80,6.674156,48.015313
2020-1277967,2020-06-30,000001,Vente,310000,3,,RTE DU CHASAL,0031,88120,88462,Le Syndicat,88,,,88462000AM0357,,,,,,,,,,,,,0,3,Dépendance,,0,S,sols,,,418,6.673928,48.015454
2020-1277967,2020-06-30,000001,Vente,310000,3,,RTE DU CHASAL,0031,88120,88462,Le Syndicat,88,,,88462000AM0357,,,,,,,,,,,,,0,2,Appartement,70,3,S,sols,,,418,6.673928,48.015454
2020-1277967,2020-06-30,000001,Vente,310000,3,,RTE DU CHASAL,0031,88120,88462,Le Syndicat,88,,,88462000AM0357,,,,,,,,,,,,,0,2,Appartement,120,4,S,sols,,,418,6.673928,48.015454
2020-1277967,2020-06-30,000001,Vente,310000,3,,RTE DU CHASAL,0031,88120,88462,Le Syndicat,88,,,88462000AM0357,,,,,,,,,,,,,0,2,Appartement,78,4,S,sols,,,418,6.673928,48.015454
2020-1277967,2020-06-30,000001,Vente,310000,3,,RTE DU CHASAL,0031,88120,88462,Le Syndicat,88,,,88462000AM0357,,,,,,,,,,,,,0,2,Appartement,75,3,S,sols,,,418,6.673928,48.015454
2020-1277967,2020-06-30,000001,Vente,310000,3,,RTE DU CHASAL,0031,88120,88462,Le Syndicat,88,,,88462000AM0357,,,,,,,,,,,,,0,3,Dépendance,,0,S,sols,,,418,6.673928,48.015454
2020-1277967,2020-06-30,000001,Vente,310000,3,,RTE DU CHASAL,0031,88120,88462,Le Syndicat,88,,,88462000AM0357,,,,,,,,,,,,,0,3,Dépendance,,0,S,sols,,,418,6.673928,48.015454
2020-1277967,2020-06-30,000001,Vente,310000,3,,RTE DU CHASAL,0031,88120,88462,Le Syndicat,88,,,88462000AM0357,,,,,,,,,,,,,0,3,Dépendance,,0,S,sols,,,418,6.673928,48.015454
2020-1277967,2020-06-30,000001,Vente,310000,,,AU THIATE,B254,88120,88462,Le Syndicat,88,,,88462000AM0362,,,,,,,,,,,,,0,,,,,T,terres,,,460,6.673872,48.015316
2020-1277967,2020-06-30,000001,Vente,310000,,,AU CHASAL,B051,88120,88462,Le Syndicat,88,,,88462000AM0363,,,,,,,,,,,,,0,,,,,S,sols,,,115,6.674221,48.015416
2020-1277988,2020-07-03,000001,Vente,160000,8,,LOT DES ANEMONES,A005,88120,88462,Le Syndicat,88,,,88462000AE0653,,,,,,,,,,,,,0,1,Maison,104,5,S,sols,,,661,6.704251,48.055362
2020-1278054,2020-06-30,000001,Vente,147679,10,,RTE DU BOURBET,0019,88120,88462,Le Syndicat,88,,,88462000AE0555,,,,,,,,,,,,,0,1,Maison,79,3,S,sols,,,1090,6.708677,48.055756
2020-1278190,2020-08-13,000001,Vente,10000,,,A LA MAIX,B140,88120,88462,Le Syndicat,88,,,88462000AM0705,,,,,,,,,,,,,0,,,,,S,sols,,,274,6.677288,48.01617
2020-1278248,2020-08-28,000001,Vente,65000,1,,IMP DES NOISETIERS,0078,88120,88462,Le Syndicat,88,,,88462000AE0553,,,,,,,,,,,,,0,1,Maison,95,4,S,sols,,,1176,6.709275,48.056042
2020-1278287,2020-09-09,000001,Vente,1,,,HAMEAU DE PECCAVILLERS,B116,88120,88462,Le Syndicat,88,,,88462000AM0610,,,,,,,,,,,,,0,,,,,P,prés,,,27,6.672025,48.01683
2020-1278287,2020-09-09,000001,Vente,1,,,HAMEAU DE PECCAVILLERS,B116,88120,88462,Le Syndicat,88,,,88462000AM0611,,,,,,,,,,,,,0,,,,,P,prés,,,323,6.672276,48.016838
2020-1278310,2020-09-11,000001,Vente,126360,20,,RUE DE LA GARE PECCAVILLERS,0058,88120,88462,Le Syndicat,88,,,88462000AM0240,,,,,,,,,,,,,0,1,Maison,100,6,S,sols,,,290,6.668672,48.01653
2020-1278310,2020-09-11,000001,Vente,126360,,,SUR LES ACCRUES,B004,88120,88462,Le Syndicat,88,,,88462000AM0316,,,,,,,,,,,,,0,,,,,T,terres,,,1273,6.668557,48.016518
2020-1278368,2020-09-26,000001,Vente,5000,,,LE PRE DU BOIS,B193,88120,88462,Le Syndicat,88,,,88462000AI0056,,,,,,,,,,,,,0,,,,,BT,taillis simples,,,4020,6.685716,48.038639
2020-1278368,2020-09-26,000001,Vente,5000,,,PRE DIAUDE,B192,88120,88462,Le Syndicat,88,,,88462000AI0074,,,,,,,,,,,,,0,,,,,P,prés,,,1040,6.685144,48.038496
2020-1278368,2020-09-26,000001,Vente,5000,,,PRE DIAUDE,B192,88120,88462,Le Syndicat,88,,,88462000AI0075,,,,,,,,,,,,,0,,,,,L,landes,FRICH,Friche,1160,6.684839,48.038441
2020-1278368,2020-09-26,000001,Vente,5000,,,LE PRE DU BOIS,B193,88120,88462,Le Syndicat,88,,,88462000AI0371,,,,,,,,,,,,,0,,,,,L,landes,FRICH,Friche,3000,6.68641,48.038146
2020-1278441,2020-10-01,000001,Vente,4000,,,LE GRAND PRE,B100,88120,88462,Le Syndicat,88,,,88462000AK0830,,,,,,,,,,,,,0,,,,,S,sols,,,1211,6.680502,48.038001
2020-1278514,2020-10-13,000001,Vente,153000,66,,RTE DE NOL,0081,88120,88462,Le Syndicat,88,,,88462000AR0076,,,,,,,,,,,,,0,1,Maison,105,3,S,sols,,,836,6.703059,48.006361
2020-1278555,2020-10-13,000001,Vente,66000,4,,RTE DE RAMONT,0114,88120,88462,Le Syndicat,88,,,88462000AR0049,,,,,,,,,,,,,0,1,Maison,120,5,S,sols,,,939,6.703699,48.00483
2020-1278659,2020-11-10,000001,Vente,5000,,,CHENAUX,B053,88120,88462,Le Syndicat,88,,,884620000F0014,,,,,,,,,,,,,0,,,,,BR,futaies résineuses,,,1990,6.693145,48.006042
2020-1278659,2020-11-10,000001,Vente,5000,,,PRE DE GOUTTE,B187,88120,88462,Le Syndicat,88,,,884620000F0324,,,,,,,,,,,,,0,,,,,BR,futaies résineuses,SAPIN,Sapins ou sapinière,6590,,
2020-1278704,2020-11-12,000001,Vente,261000,,,LE HAUT DES HATS,B123,88120,88462,Le Syndicat,88,,,88462000AK0101,,,,,,,,,,,,,0,,,,,S,sols,,,335,6.682396,48.035833
2020-1278704,2020-11-12,000001,Vente,261000,10,,RTE DE LA PRELE,0110,88120,88462,Le Syndicat,88,,,88462000AK0899,,,,,,,,,,,,,0,1,Maison,170,6,S,sols,,,1368,6.681956,48.035635
2020-1278704,2020-11-12,000001,Vente,261000,,,AUX MURS,B158,88120,88462,Le Syndicat,88,,,88462000AK0902,,,,,,,,,,,,,0,,,,,P,prés,,,702,6.682177,48.035956
2020-1278704,2020-11-12,000001,Vente,261000,,,LE HAUT DES HATS,B123,88120,88462,Le Syndicat,88,,,88462000AK0968,,,,,,,,,,,,,0,,,,,S,sols,,,268,6.682187,48.035749
2020-1278704,2020-11-12,000001,Vente,261000,,,LE HAUT DES HATS,B123,88120,88462,Le Syndicat,88,,,88462000AK1265,,,,,,,,,,,,,0,,,,,BM,futaies mixtes,,,1620,6.682328,48.035627
2020-1278724,2020-11-26,000001,Vente,193000,22,,RTE DE PECCAVILLERS,0097,88120,88462,Le Syndicat,88,,,88462000AM0144,,,,,,,,,,,,,0,1,Maison,145,5,S,sols,,,299,6.677117,48.016592
2020-1278724,2020-11-26,000001,Vente,193000,,,HAMEAU DE PECCAVILLERS,B116,88120,88462,Le Syndicat,88,,,88462000AM0460,,,,,,,,,,,,,0,,,,,S,sols,,,1406,6.6771,48.016692
2020-1278736,2020-11-24,000001,Vente,87500,3,,CHE DES MEZES,0064,88120,88462,Le Syndicat,88,,,88462000AE0611,,,,,,,,,,,,,0,1,Maison,78,4,S,sols,,,1080,6.700651,48.053275
2020-1278818,2020-11-24,000001,Vente,149812,9,,RUE DE LA GARE PECCAVILLERS,0058,88120,88462,Le Syndicat,88,,,88462000AM0470,,,9,,,,,,,,,,1,3,Dépendance,,0,,,,,,6.66819,48.01496
2020-1278818,2020-11-24,000001,Vente,149812,9,,RUE DE LA GARE PECCAVILLERS,0058,88120,88462,Le Syndicat,88,,,88462000AM0470,,,3,94.64,,,,,,,,,1,2,Appartement,100,1,,,,,,6.66819,48.01496
2020-1278921,2020-12-18,000001,Vente,94500,12,,RTE DE NOL,0081,88120,88462,Le Syndicat,88,,,88462000AO0050,,,,,,,,,,,,,0,1,Maison,52,4,S,sols,,,1200,6.698591,48.014839
2020-1278921,2020-12-18,000001,Vente,94500,12,,RTE DE NOL,0081,88120,88462,Le Syndicat,88,,,88462000AO0050,,,,,,,,,,,,,0,1,Maison,52,4,J,jardins,,,552,6.698591,48.014839
2020-1278944,2020-12-21,000001,Vente,1,,,JULIENRUPT LE HAUT,B131,88120,88462,Le Syndicat,88,,,88462000AE0557,,,,,,,,,,,,,0,,,,,S,sols,,,402,6.709006,48.055969
2020-1278958,2020-12-22,000001,Vente,2500,,,LA ROCHE LAURENT,B233,88120,88462,Le Syndicat,88,,,88462000AL0195,,,,,,,,,,,,,0,,,,,P,prés,,,2270,6.689865,48.023885
2020-1278958,2020-12-22,000001,Vente,2500,,,LE SAUSSELE,B241,88120,88462,Le Syndicat,88,,,88462000AL0659,,,,,,,,,,,,,0,,,,,P,prés,,,6071,6.689405,48.023794
2020-1278960,2020-12-15,000001,Vente,172000,11,,RTE DU CHASAL,0031,88120,88462,Le Syndicat,88,,,88462000AM0449,,,,,,,,,,,,,0,1,Maison,82,5,S,sols,,,980,6.674298,48.015254
2020-1279001,2020-12-21,000001,Vente,49500,,,LA ROCHE DE FOURCHE,B232,88120,88462,Le Syndicat,88,,,88462000AM0715,,,,,,,,,,,,,0,,,,,S,sols,,,17,6.667887,48.015446
2020-1279001,2020-12-21,000001,Vente,49500,,,LA ROCHE DE FOURCHE,B232,88120,88462,Le Syndicat,88,,,88462000AM0731,,,,,,,,,,,,,0,,,,,S,sols,,,555,6.667723,48.015425
2020-1279001,2020-12-21,000001,Vente,49500,,,LA ROCHE DE FOURCHE,B232,88120,88462,Le Syndicat,88,,,88462000AM0732,,,,,,,,,,,,,0,,,,,S,sols,,,519,6.667555,48.015488
2020-1279001,2020-12-21,000001,Vente,49500,,,LA ROCHE DE FOURCHE,B232,88120,88462,Le Syndicat,88,,,88462000AM0733,,,,,,,,,,,,,0,,,,,S,sols,,,285,6.667527,48.015645
2020-1279002,2020-12-22,000001,Vente,19000,,,SUR LES ACCRUES,B004,88120,88462,Le Syndicat,88,,,88462000AM0707,,,,,,,,,,,,,0,,,,,P,prés,,,147,6.666911,48.016004
2020-1279002,2020-12-22,000001,Vente,19000,24,,RUE DE LA GARE PECCAVILLERS,0058,88120,88462,Le Syndicat,88,,,88462000AM0728,,,,,,,,,,,,,0,4,Local industriel. commercial ou assimilé,1000,0,S,sols,,,567,6.667023,48.015863
2020-1279002,2020-12-22,000001,Vente,19000,,,LA ROCHE DE FOURCHE,B232,88120,88462,Le Syndicat,88,,,88462000AM0729,,,,,,,,,,,,,0,,,,,S,sols,,,2760,6.666875,48.015659
2020-1279002,2020-12-22,000001,Vente,19000,,,LA ROCHE DE FOURCHE,B232,88120,88462,Le Syndicat,88,,,88462000AM0733,,,,,,,,,,,,,0,,,,,S,sols,,,285,6.667527,48.015645
2020-1279003,2020-12-30,000001,Vente,16000,,,LA ROCHE DE FOURCHE,B232,88120,88462,Le Syndicat,88,,,88462000AM0730,,,,,,,,,,,,,0,,,,,S,sols,,,1409,6.667282,48.015362
2020-1279003,2020-12-30,000001,Vente,16000,,,LA ROCHE DE FOURCHE,B232,88120,88462,Le Syndicat,88,,,88462000AM0733,,,,,,,,,,,,,0,,,,,S,sols,,,285,6.667527,48.015645
2020-1279008,2020-12-23,000001,Vente,16000,,,LES FEIGNES DES BRULEUX,B081,88120,88462,Le Syndicat,88,,,88462000AE0978,,,,,,,,,,,,,0,,,,,S,sols,,,88,6.699997,48.057333
2020-1279008,2020-12-23,000001,Vente,16000,,,LES FEIGNES DES BRULEUX,B081,88120,88462,Le Syndicat,88,,,88462000AE0979,,,,,,,,,,,,,0,,,,,S,sols,,,111,6.700088,48.057343
2020-1279008,2020-12-23,000001,Vente,16000,,,LES FEIGNES DES BRULEUX,B081,88120,88462,Le Syndicat,88,,,88462000AE0980,,,,,,,,,,,,,0,,,,,S,sols,,,88,6.700209,48.057349
2020-1279008,2020-12-23,000001,Vente,16000,,,LES FEIGNES DES BRULEUX,B081,88120,88462,Le Syndicat,88,,,88462000AE0981,,,,,,,,,,,,,0,,,,,S,sols,,,179,6.700347,48.057363
2020-1279008,2020-12-23,000001,Vente,16000,,,LES FEIGNES DES BRULEUX,B081,88120,88462,Le Syndicat,88,,,88462000AE0982,,,,,,,,,,,,,0,,,,,S,sols,,,158,6.700546,48.057407
2020-1279008,2020-12-23,000001,Vente,16000,,,LES FEIGNES DES BRULEUX,B081,88120,88462,Le Syndicat,88,,,88462000AE0983,,,,,,,,,,,,,0,,,,,S,sols,,,2140,6.700286,48.05737
2020-1279013,2020-12-30,000001,Vente,755,,,LES CHAMPS LEUX,B047,88120,88462,Le Syndicat,88,,,884620000E0100,,,,,,,,,,,,,0,,,,,T,terres,,,1510,6.689529,48.018246
2020-1279014,2020-12-28,000001,Vente,27500,,,LES FEIGNES DES BRULEUX,B081,88120,88462,Le Syndicat,88,,,88462000AE0032,,,1,52,2,55,3,55,4,54,,,4,3,Dépendance,,0,,,,,,6.701204,48.05742
2020-1279015,2020-12-29,000001,Vente,28000,,,LES FEIGNES DES BRULEUX,B081,88120,88462,Le Syndicat,88,,,88462000AE0032,,,10,1045,,,,,,,,,1,4,Local industriel. commercial ou assimilé,1200,0,,,,,,6.701204,48.05742
2020-1279016,2020-12-28,000001,Vente,5000,,,LES FEIGNES DES BRULEUX,B081,88120,88462,Le Syndicat,88,,,88462000AE0032,,,5,62,,,,,,,,,1,3,Dépendance,,0,,,,,,6.701204,48.05742
2020-1279017,2020-12-29,000001,Vente,22000,,,LES FEIGNES DES BRULEUX,B081,88120,88462,Le Syndicat,88,,,88462000AE0032,,,12,89,13,89,,,,,,,2,4,Local industriel. commercial ou assimilé,180,0,,,,,,6.701204,48.05742
2020-1279018,2020-12-28,000001,Vente,17000,29,B,RTE DE L USINE,0147,88120,88462,Le Syndicat,88,,,88462000AE0032,,,8,173,,,,,,,,,1,4,Local industriel. commercial ou assimilé,173,0,,,,,,6.701204,48.05742
2020-1279019,2020-12-30,000001,Vente,15000,29,B,RTE DE L USINE,0147,88120,88462,Le Syndicat,88,,,88462000AE0032,,,7,112,,,,,,,,,1,4,Local industriel. commercial ou assimilé,112,0,,,,,,6.701204,48.05742
2020-1279021,2020-12-22,000001,Vente,160000,,,JULIENRUPT LE BAS,B130,88120,88462,Le Syndicat,88,,,88462000AE0880,,,101,,,,,,,,,,1,2,Appartement,109,3,,,,,,6.704853,48.057248
