id_mutation,date_mutation,numero_disposition,nature_mutation,valeur_fonciere,adresse_numero,adresse_suffixe,adresse_nom_voie,adresse_code_voie,code_postal,code_commune,nom_commune,code_departement,ancien_code_commune,ancien_nom_commune,id_parcelle,ancien_id_parcelle,numero_volume,lot1_numero,lot1_surface_carrez,lot2_numero,lot2_surface_carrez,lot3_numero,lot3_surface_carrez,lot4_numero,lot4_surface_carrez,lot5_numero,lot5_surface_carrez,nombre_lots,code_type_local,type_local,surface_reelle_bati,nombre_pieces_principales,code_nature_culture,nature_culture,code_nature_culture_speciale,nature_culture_speciale,surface_terrain,longitude,latitude
2020-1271281,2020-06-08,000001,Vente,65375.4,,,LE THERME,B087,88300,88478,Tranqueville-Graux,88,,,88478000ZA0025,,,,,,,,,,,,,0,,,,,T,terres,,,11773,5.85014,48.44179
2020-1271281,2020-06-08,000001,Vente,65375.4,,,LE THERME,B087,88300,88478,Tranqueville-Graux,88,,,88478000ZA0025,,,,,,,,,,,,,0,,,,,T,terres,,,5887,5.85014,48.44179
2020-1271281,2020-06-08,000001,Vente,65375.4,,,TERRE QUIDOUILLE,B086,88300,88478,Tranqueville-Graux,88,,,88478000ZB0002,,,,,,,,,,,,,0,,,,,BT,taillis simples,,,1800,5.858833,48.450215
2020-1271281,2020-06-08,000001,Vente,65375.4,,,TERRE QUIDOUILLE,B086,88300,88478,Tranqueville-Graux,88,,,88478000ZB0002,,,,,,,,,,,,,0,,,,,T,terres,,,9090,5.858833,48.450215
2020-1271281,2020-06-08,000001,Vente,65375.4,,,TERRE QUIDOUILLE,B086,88300,88478,Tranqueville-Graux,88,,,88478000ZB0002,,,,,,,,,,,,,0,,,,,L,landes,FRICH,Friche,3230,5.858833,48.450215
2020-1271281,2020-06-08,000001,Vente,65375.4,,,NACHENEVAUX,B063,88300,88478,Tranqueville-Graux,88,,,88478000ZC0004,,,,,,,,,,,,,0,,,,,P,prés,,,1630,5.880687,48.440783
2020-1271281,2020-06-08,000001,Vente,65375.4,,,LES ETAUX,B034,88300,88478,Tranqueville-Graux,88,,,88478000ZD0004,,,,,,,,,,,,,0,,,,,L,landes,PACAG,Pacage,53490,5.853693,48.422711
2020-1271281,2020-06-08,000001,Vente,65375.4,,,LA SUME,B082,88300,88478,Tranqueville-Graux,88,,,88478000ZE0018,,,,,,,,,,,,,0,,,,,T,terres,,,5253,5.836781,48.428043
2020-1271281,2020-06-08,000001,Vente,65375.4,,,LA SUME,B082,88300,88478,Tranqueville-Graux,88,,,88478000ZE0018,,,,,,,,,,,,,0,,,,,T,terres,,,15757,5.836781,48.428043
2020-1271281,2020-06-08,000001,Vente,65375.4,,,LA SUME,B082,88300,88478,Tranqueville-Graux,88,,,88478000ZE0019,,,,,,,,,,,,,0,,,,,P,prés,,,10170,5.836254,48.428382
2020-1271281,2020-06-08,000001,Vente,65375.4,,,LA SUME,B082,88300,88478,Tranqueville-Graux,88,,,88478000ZE0019,,,,,,,,,,,,,0,,,,,L,landes,PACAG,Pacage,19540,5.836254,48.428382
2020-1271281,2020-06-08,000001,Vente,65375.4,,,AU PARADIS,B066,88300,88478,Tranqueville-Graux,88,,,88478000ZE0055,,,,,,,,,,,,,0,,,,,VE,vergers,,,1225,5.849974,48.434841
2020-1271281,2020-06-08,000001,Vente,65375.4,,,AU PARADIS,B066,88300,88478,Tranqueville-Graux,88,,,88478000ZE0055,,,,,,,,,,,,,0,,,,,P,prés,,,4195,5.849974,48.434841
2020-1271281,2020-06-08,000001,Vente,65375.4,,,AU PARADIS,B066,88300,88478,Tranqueville-Graux,88,,,88478000ZE0056,,,,,,,,,,,,,0,,,,,P,prés,,,1300,5.849732,48.434742
2020-1271281,2020-06-08,000001,Vente,65375.4,,,AU PARADIS,B066,88300,88478,Tranqueville-Graux,88,,,88478000ZE0057,,,,,,,,,,,,,0,,,,,P,prés,,,7260,5.85056,48.43498
2020-1271281,2020-06-08,000001,Vente,65375.4,,,LE GOUSSOT,B043,88300,88478,Tranqueville-Graux,88,,,88478000ZE0089,,,,,,,,,,,,,0,,,,,P,prés,,,6288,5.848234,48.433594
2020-1271281,2020-06-08,000001,Vente,65375.4,,,LE CROTEL,B024,88300,88478,Tranqueville-Graux,88,,,88478000ZH0015,,,,,,,,,,,,,0,,,,,P,prés,,,27120,5.83948,48.435187
2020-1271281,2020-06-08,000001,Vente,65375.4,,,BLANCHEFONTAINE,B006,88300,88478,Tranqueville-Graux,88,,,88478000ZH0025,,,,,,,,,,,,,0,,,,,T,terres,,,7780,5.835159,48.432701
2020-1271281,2020-06-08,000001,Vente,65375.4,,,BLANCHEFONTAINE,B006,88300,88478,Tranqueville-Graux,88,,,88478000ZH0025,,,,,,,,,,,,,0,,,,,T,terres,,,7780,5.835159,48.432701
2020-1271281,2020-06-08,000001,Vente,65375.4,,,BLANCHEFONTAINE,B006,88300,88478,Tranqueville-Graux,88,,,88478000ZH0025,,,,,,,,,,,,,0,,,,,T,terres,,,7780,5.835159,48.432701
2020-1272011,2020-07-21,000001,Vente,1200,,,PRE COQ,B069,88300,88478,Tranqueville-Graux,88,,,88478000ZC0013,,,,,,,,,,,,,0,,,,,P,prés,,,1890,5.874767,48.435513
2020-1272312,2020-08-25,000001,Vente,200,,,LE VILLAGE,B094,88300,88478,Tranqueville-Graux,88,,,884780000F0136,,,,,,,,,,,,,0,,,,,VE,vergers,,,185,5.849978,48.437369
2020-1273188,2020-10-20,000001,Vente,15000,,,LE VILLAGE,B094,88300,88478,Tranqueville-Graux,88,,,884780000F0123,,,,,,,,,,,,,0,,,,,VE,vergers,,,967,5.84962,48.436455
2020-1273188,2020-10-20,000001,Vente,15000,,,LE VILLAGE,B094,88300,88478,Tranqueville-Graux,88,,,884780000F0123,,,,,,,,,,,,,0,,,,,S,sols,,,242,5.84962,48.436455
2020-1273188,2020-10-20,000001,Vente,15000,,,LE VILLAGE,B094,88300,88478,Tranqueville-Graux,88,,,884780000F0125,,,,,,,,,,,,,0,,,,,J,jardins,,,509,5.849899,48.436527
2020-1273188,2020-10-20,000001,Vente,15000,,,LE VILLAGE,B094,88300,88478,Tranqueville-Graux,88,,,884780000F0198,,,,,,,,,,,,,0,,,,,S,sols,,,281,5.849307,48.436599
2020-1273188,2020-10-20,000001,Vente,15000,,,LE VILLAGE,B094,88300,88478,Tranqueville-Graux,88,,,884780000F0199,,,,,,,,,,,,,0,,,,,S,sols,,,423,5.84962,48.43667
2020-1273188,2020-10-20,000001,Vente,15000,,,LE VILLAGE,B094,88300,88478,Tranqueville-Graux,88,,,884780000F0200,,,,,,,,,,,,,0,,,,,S,sols,,,272,5.849503,48.436573
2020-1273372,2020-10-29,000001,Vente,2460,,,L ESPAGNOL,B032,88300,88478,Tranqueville-Graux,88,,,88478000ZE0050,,,,,,,,,,,,,0,,,,,T,terres,,,2734,5.849735,48.43078
2020-1273372,2020-10-29,000001,Vente,2460,,,L ESPAGNOL,B032,88300,88478,Tranqueville-Graux,88,,,88478000ZE0050,,,,,,,,,,,,,0,,,,,T,terres,,,5466,5.849735,48.43078
2020-1273373,2020-10-29,000001,Vente,1000,,,FOND DU POIRIER,B039,88300,88478,Tranqueville-Graux,88,,,88478000ZE0025,,,,,,,,,,,,,0,,,,,P,prés,,,3400,5.843306,48.429899
2020-1273376,2020-10-29,000001,Vente,12052,,,LA CORVEE,B017,88300,88478,Tranqueville-Graux,88,,,88478000ZB0013,,,,,,,,,,,,,0,,,,,T,terres,,,9960,5.857357,48.441746
2020-1273376,2020-10-29,000001,Vente,12052,,,BOUT DES HERBUES,B009,88300,88478,Tranqueville-Graux,88,,,88478000ZE0100,,,,,,,,,,,,,0,,,,,P,prés,,,23688,5.857564,48.43265
2020-1273376,2020-10-29,000001,Vente,12052,,,BOUT DES HERBUES,B009,88300,88478,Tranqueville-Graux,88,,,88478000ZE0100,,,,,,,,,,,,,0,,,,,L,landes,PACAG,Pacage,6525,5.857564,48.43265
2020-1273379,2020-10-29,000001,Vente,11979,,,LE THERME,B087,88300,88478,Tranqueville-Graux,88,,,88478000ZA0028,,,,,,,,,,,,,0,,,,,VE,vergers,,,3630,5.851138,48.441348
2020-1273379,2020-10-29,000001,Vente,11979,,,FOND DU POIRIER,B039,88300,88478,Tranqueville-Graux,88,,,88478000ZE0022,,,,,,,,,,,,,0,,,,,T,terres,,,15908,5.838172,48.425583
2020-1273379,2020-10-29,000001,Vente,11979,,,FOND DU POIRIER,B039,88300,88478,Tranqueville-Graux,88,,,88478000ZE0022,,,,,,,,,,,,,0,,,,,L,landes,PACAG,Pacage,12438,5.838172,48.425583
2020-1273379,2020-10-29,000001,Vente,11979,,,FOND DU POIRIER,B039,88300,88478,Tranqueville-Graux,88,,,88478000ZE0022,,,,,,,,,,,,,0,,,,,T,terres,,,7954,5.838172,48.425583
2020-1273382,2020-10-22,000001,Vente,6555,,,LE VILLAGE,B094,88300,88478,Tranqueville-Graux,88,,,884780000F0146,,,,,,,,,,,,,0,,,,,P,prés,,,2681,5.851024,48.437469
2020-1273382,2020-10-22,000001,Vente,6555,,,NACHENEVAUX,B063,88300,88478,Tranqueville-Graux,88,,,88478000ZC0006,,,,,,,,,,,,,0,,,,,P,prés,,,3630,5.879806,48.439561
2020-1273382,2020-10-22,000001,Vente,6555,,,GRANDS ESSARTS,B049,88300,88478,Tranqueville-Graux,88,,,88478000ZD0009,,,,,,,,,,,,,0,,,,,T,terres,,,7765,5.855549,48.419844
2020-1273382,2020-10-22,000001,Vente,6555,,,GRANDS ESSARTS,B049,88300,88478,Tranqueville-Graux,88,,,88478000ZD0009,,,,,,,,,,,,,0,,,,,T,terres,,,7765,5.855549,48.419844
2020-1273386,2020-10-22,000001,Vente,6170,,,LE VILLAGE,B094,88300,88478,Tranqueville-Graux,88,,,884780000F0144,,,,,,,,,,,,,0,,,,,P,prés,,,588,5.850696,48.437655
2020-1273386,2020-10-22,000001,Vente,6170,,,LE VILLAGE,B094,88300,88478,Tranqueville-Graux,88,,,884780000F0145,,,,,,,,,,,,,0,,,,,VE,vergers,,,1198,5.850903,48.437734
2020-1273386,2020-10-22,000001,Vente,6170,,,LE VILLAGE,B094,88300,88478,Tranqueville-Graux,88,,,884780000F0148,,,,,,,,,,,,,0,,,,,P,prés,,,1410,5.851369,48.437426
2020-1273386,2020-10-22,000001,Vente,6170,,,LES BRUYERES,B011,88300,88478,Tranqueville-Graux,88,,,88478000ZA0004,,,,,,,,,,,,,0,,,,,T,terres,,,710,5.836018,48.442175
2020-1273386,2020-10-22,000001,Vente,6170,,,LES BRUYERES,B011,88300,88478,Tranqueville-Graux,88,,,88478000ZA0004,,,,,,,,,,,,,0,,,,,T,terres,,,1510,5.836018,48.442175
2020-1273386,2020-10-22,000001,Vente,6170,,,LES BRUYERES,B011,88300,88478,Tranqueville-Graux,88,,,88478000ZA0004,,,,,,,,,,,,,0,,,,,L,landes,FRICH,Friche,6440,5.836018,48.442175
2020-1273386,2020-10-22,000001,Vente,6170,,,LE PERLOT,B067,88300,88478,Tranqueville-Graux,88,,,88478000ZE0002,,,,,,,,,,,,,0,,,,,P,prés,,,2978,5.846581,48.434053
2020-1273386,2020-10-22,000001,Vente,6170,,,LE PERLOT,B067,88300,88478,Tranqueville-Graux,88,,,88478000ZE0002,,,,,,,,,,,,,0,,,,,T,terres,,,1344,5.846581,48.434053
2020-1273386,2020-10-22,000001,Vente,6170,,,LE PERLOT,B067,88300,88478,Tranqueville-Graux,88,,,88478000ZE0002,,,,,,,,,,,,,0,,,,,T,terres,,,2688,5.846581,48.434053
