id_mutation,date_mutation,numero_disposition,nature_mutation,valeur_fonciere,adresse_numero,adresse_suffixe,adresse_nom_voie,adresse_code_voie,code_postal,code_commune,nom_commune,code_departement,ancien_code_commune,ancien_nom_commune,id_parcelle,ancien_id_parcelle,numero_volume,lot1_numero,lot1_surface_carrez,lot2_numero,lot2_surface_carrez,lot3_numero,lot3_surface_carrez,lot4_numero,lot4_surface_carrez,lot5_numero,lot5_surface_carrez,nombre_lots,code_type_local,type_local,surface_reelle_bati,nombre_pieces_principales,code_nature_culture,nature_culture,code_nature_culture_speciale,nature_culture_speciale,surface_terrain,longitude,latitude
2020-1279960,2020-05-20,000001,Vente,109000,,,LA FAYETTE,B060,89700,89262,Molosmes,89,,,89262000AD0006,,,,,,,,,,,,,0,,,,,VE,vergers,,,1340,4.018967,47.920528
2020-1279960,2020-05-20,000001,Vente,109000,151,,LA FAYETTE,B060,89700,89262,Molosmes,89,,,89262000AD0022,,,,,,,,,,,,,0,1,Maison,100,5,AG,terrains d'agrément,,,1441,4.019333,47.920335
2020-1279960,2020-05-20,000001,Vente,109000,151,,LA FAYETTE,B060,89700,89262,Molosmes,89,,,89262000AD0022,,,,,,,,,,,,,0,1,Maison,100,5,S,sols,,,1000,4.019333,47.920335
2020-1280357,2020-06-30,000001,Vente,35000,17,,GR GRANDE RUE,0085,89700,89262,Molosmes,89,,,89262000AC0422,,,,,,,,,,,,,0,1,Maison,75,2,S,sols,,,509,4.046334,47.885441
2020-1280357,2020-06-30,000001,Vente,35000,,,SENTIER DE GLAND,B107,89700,89262,Molosmes,89,,,89262000ZX0096,,,,,,,,,,,,,0,,,,,BT,taillis simples,,,512,4.046688,47.885889
2020-1280388,2020-02-14,000001,Vente,32656,,,PIEDS DE BOIS,B090,89700,89262,Molosmes,89,,,89262000YA0163,,,,,,,,,,,,,0,,,,,BT,taillis simples,,,524,4.022516,47.873849
2020-1280388,2020-02-14,000001,Vente,32656,,,PIEDS DE BOIS,B090,89700,89262,Molosmes,89,,,89262000YA0163,,,,,,,,,,,,,0,,,,,VI,vignes,VAOC,Vins d'appellation d'origine contrôlée,4500,4.022516,47.873849
2020-1281005,2020-10-01,000001,Vente,,,,SAINT JOB,B103,89700,89262,Molosmes,89,,,89262000ZI0040,,,,,,,,,,,,,0,,,,,T,terres,,,3670,4.058841,47.893031
2020-1281005,2020-10-01,000001,Vente,,,,LES LAIVIERES,B078,89700,89262,Molosmes,89,,,89262000ZI0044,,,,,,,,,,,,,0,,,,,T,terres,,,2790,4.05818,47.895954
2020-1281005,2020-10-01,000002,Vente,,,,LES BIMES,B012,89700,89262,Molosmes,89,,,892620000D0367,,,,,,,,,,,,,0,,,,,T,terres,,,4268,4.055665,47.883136
2020-1281005,2020-10-01,000002,Vente,,,,LES CHARRIERES,B028,89700,89262,Molosmes,89,,,89262000YB0068,,,,,,,,,,,,,0,,,,,L,landes,,,537,4.031819,47.884245
2020-1281005,2020-10-01,000002,Vente,,,,LES CHARRIERES,B028,89700,89262,Molosmes,89,,,89262000YB0068,,,,,,,,,,,,,0,,,,,T,terres,,,15618,4.031819,47.884245
2020-1281005,2020-10-01,000002,Vente,,,,ROUGE VAUX,B099,89700,89262,Molosmes,89,,,89262000ZN0021,,,,,,,,,,,,,0,,,,,T,terres,,,8335,4.041611,47.868375
2020-1281005,2020-10-01,000002,Vente,,,,ROUGE VAUX,B099,89700,89262,Molosmes,89,,,89262000ZN0021,,,,,,,,,,,,,0,,,,,T,terres,,,8335,4.041611,47.868375
2020-1281005,2020-10-01,000003,Vente,,,,LE GRAND VAUT,B064,89700,89262,Molosmes,89,,,892620000G0030,,,,,,,,,,,,,0,,,,,T,terres,,,1140,4.022426,47.896994
2020-1281005,2020-10-01,000003,Vente,,,,RACINEUIL,B095,89700,89262,Molosmes,89,,,89262000ZE0021,,,,,,,,,,,,,0,,,,,T,terres,,,8260,4.03747,47.893625
2020-1281005,2020-10-01,000003,Vente,,,,RACINEUIL,B095,89700,89262,Molosmes,89,,,89262000ZE0021,,,,,,,,,,,,,0,,,,,T,terres,,,4130,4.03747,47.893625
2020-1281005,2020-10-01,000003,Vente,,,,RACINEUIL,B095,89700,89262,Molosmes,89,,,89262000ZE0022,,,,,,,,,,,,,0,,,,,T,terres,,,3853,4.038092,47.893571
2020-1281005,2020-10-01,000003,Vente,,,,RACINEUIL,B095,89700,89262,Molosmes,89,,,89262000ZE0022,,,,,,,,,,,,,0,,,,,T,terres,,,7707,4.038092,47.893571
2020-1281005,2020-10-01,000003,Vente,,,,BAS DE VOIES DE BOUCHERES,B005,89700,89262,Molosmes,89,,,89262000ZH0044,,,,,,,,,,,,,0,,,,,T,terres,,,5810,4.04279,47.899058
2020-1281005,2020-10-01,000003,Vente,,,,BAS DE VOIES DE BOUCHERES,B005,89700,89262,Molosmes,89,,,89262000ZH0044,,,,,,,,,,,,,0,,,,,T,terres,,,5810,4.04279,47.899058
2020-1281476,2020-10-17,000001,Vente,22000,7,,RUE DE LA VOUTE,0230,89700,89262,Molosmes,89,,,89262000AC0185,,,,,,,,,,,,,0,1,Maison,69,3,S,sols,,,77,4.042592,47.886386
2020-1281476,2020-10-17,000001,Vente,22000,,,LE VILLAGE,B125,89700,89262,Molosmes,89,,,89262000AC0186,,,,,,,,,,,,,0,,,,,S,sols,,,31,4.042728,47.886426
2020-1281476,2020-10-17,000001,Vente,22000,,,LE VILLAGE,B125,89700,89262,Molosmes,89,,,89262000AC0372,,,,,,,,,,,,,0,,,,,S,sols,,,4,4.042545,47.886356
2020-1281476,2020-10-17,000001,Vente,22000,,,LA VOUTE,B130,89700,89262,Molosmes,89,,,892620000E0160,,,,,,,,,,,,,0,,,,,L,landes,,,230,4.042049,47.885953
2020-1281712,2020-11-24,000001,Vente,18750.5,,,BEU DE VIN,B011,89700,89262,Molosmes,89,,,89262000YB0045,,,,,,,,,,,,,0,,,,,BT,taillis simples,,,6104,4.030892,47.888549
2020-1281712,2020-11-24,000001,Vente,18750.5,,,BEU DE VIN,B011,89700,89262,Molosmes,89,,,89262000YB0046,,,,,,,,,,,,,0,,,,,L,landes,,,1520,4.031195,47.889974
2020-1281988,2020-12-12,000001,Vente,40000,15,,GR GRANDE RUE,0085,89700,89262,Molosmes,89,,,89262000AC0043,,,,,,,,,,,,,0,1,Maison,64,2,S,sols,,,528,4.046559,47.885375
2020-1281988,2020-12-12,000001,Vente,40000,15,,GR GRANDE RUE,0085,89700,89262,Molosmes,89,,,89262000AC0043,,,,,,,,,,,,,0,1,Maison,15,1,S,sols,,,528,4.046559,47.885375
2020-1281988,2020-12-12,000001,Vente,40000,,,LE VILLAGE,B125,89700,89262,Molosmes,89,,,89262000AC0076,,,,,,,,,,,,,0,,,,,BT,taillis simples,,,214,4.047787,47.884734
2020-1281988,2020-12-12,000001,Vente,40000,,,LE VILLAGE,B125,89700,89262,Molosmes,89,,,89262000AC0077,,,,,,,,,,,,,0,,,,,J,jardins,,,96,4.047862,47.885042
2020-1281996,2020-12-10,000001,Vente,600,,,LE VILLAGE,B125,89700,89262,Molosmes,89,,,89262000AC0222,,,,,,,,,,,,,0,,,,,BT,taillis simples,,,505,4.041346,47.888235
