id_mutation,date_mutation,numero_disposition,nature_mutation,valeur_fonciere,adresse_numero,adresse_suffixe,adresse_nom_voie,adresse_code_voie,code_postal,code_commune,nom_commune,code_departement,ancien_code_commune,ancien_nom_commune,id_parcelle,ancien_id_parcelle,numero_volume,lot1_numero,lot1_surface_carrez,lot2_numero,lot2_surface_carrez,lot3_numero,lot3_surface_carrez,lot4_numero,lot4_surface_carrez,lot5_numero,lot5_surface_carrez,nombre_lots,code_type_local,type_local,surface_reelle_bati,nombre_pieces_principales,code_nature_culture,nature_culture,code_nature_culture_speciale,nature_culture_speciale,surface_terrain,longitude,latitude
2020-1279118,2020-01-30,000001,Vente,197500,3,,ALL DES EGLANTIERS,0135,89000,89295,Perrigny,89,,,89295000AR0225,,,,,,,,,,,,,0,1,Maison,81,4,S,sols,,,907,3.535418,47.822392
2020-1279526,2020-02-25,000001,Vente,133150,36,,GR GRANDE RUE,0190,89000,89295,Perrigny,89,,,89295000AR0353,,,,,,,,,,,,,0,1,Maison,72,3,S,sols,,,134,3.533499,47.820993
2020-1279704,2020-03-20,000001,Vente,390000,4,,RUE DU PRESSOIR,0300,89000,89295,Perrigny,89,,,89295000AE0311,,,,,,,,,,,,,0,1,Maison,186,6,S,sols,,,991,3.545284,47.829551
2020-1279704,2020-03-20,000001,Vente,390000,,,LES COUPES DES LIENS,B025,89000,89295,Perrigny,89,,,89295000AE0331,,,,,,,,,,,,,0,,,,,S,sols,,,529,3.545501,47.829713
2020-1279927,2020-05-16,000001,Vente,76297.5,8,,ALL DU CHARDONNAY,0053,89000,89295,Perrigny,89,,,89295000AE0384,,,,,,,,,,,,,0,1,Maison,82,4,S,sols,,,770,3.54293,47.82802
2020-1279928,2020-05-15,000001,Vente,7000,,,LE BAS DES COURLIS,B005,89000,89295,Perrigny,89,,,89295000AD0001,,,,,,,,,,,,,0,,,,,BT,taillis simples,,,700,3.534263,47.83775
2020-1279928,2020-05-15,000001,Vente,7000,,,LA BARCELLE,B003,89000,89295,Perrigny,89,,,89295000AD0026,,,,,,,,,,,,,0,,,,,BS,taillis sous futaie,,,90955,3.538822,47.837781
2020-1279928,2020-05-15,000001,Vente,7000,,,CHAMPS DES LAPEREAUX,B020,89000,89295,Perrigny,89,,,89295000AD0070,,,,,,,,,,,,,0,,,,,BT,taillis simples,,,2623,3.543593,47.839822
2020-1280173,2020-06-05,000001,Vente,185000,14,,RUE DES VIGNES,0420,89000,89295,Perrigny,89,,,89295000AH0157,,,,,,,,,,,,,0,1,Maison,248,6,S,sols,,,935,3.545711,47.826444
2020-1280173,2020-06-05,000001,Vente,185000,,,LES GUINAUDES,B044,89000,89295,Perrigny,89,,,89295000AH0237,,,,,,,,,,,,,0,,,,,AB,terrains a bâtir,,,503,3.546047,47.826675
2020-1280227,2020-06-18,000001,Vente,136000,5,,RUE DU VILLAGE,0430,89000,89295,Perrigny,89,,,89295000AP0103,,,,,,,,,,,,,0,1,Maison,63,4,S,sols,,,795,3.537442,47.818354
2020-1280372,2020-06-26,000002,Vente,1540,,,LE VILLAGE,B078,89000,89295,Perrigny,89,,,89295000AR0752,,,,,,,,,,,,,0,,,,,S,sols,,,77,3.536091,47.819874
2020-1280429,2020-07-09,000001,Vente,4410,,,LES COUPES DES LIENS,B025,89000,89295,Perrigny,89,,,89295000AE0018,,,,,,,,,,,,,0,,,,,T,terres,,,2462,3.546806,47.830408
2020-1280429,2020-07-09,000001,Vente,4410,,,LES COUPES DES LIENS,B025,89000,89295,Perrigny,89,,,89295000AE0019,,,,,,,,,,,,,0,,,,,T,terres,,,619,3.546539,47.830237
2020-1280429,2020-07-09,000001,Vente,4410,,,LES COUPES DES LIENS,B025,89000,89295,Perrigny,89,,,89295000AE0020,,,,,,,,,,,,,0,,,,,T,terres,,,2402,3.546443,47.830057
2020-1280429,2020-07-09,000001,Vente,4410,,,LES COUPES DES LIENS,B025,89000,89295,Perrigny,89,,,89295000AE0021,,,,,,,,,,,,,0,,,,,T,terres,,,1177,3.546157,47.830006
2020-1280429,2020-07-09,000001,Vente,4410,,,TERRES ET VIGNES DE L AUGE,B073,89000,89295,Perrigny,89,,,89295000AL0568,,,,,,,,,,,,,0,,,,,T,terres,,,5599,3.554092,47.817468
2020-1280429,2020-07-09,000001,Vente,4410,,,TERRES ET VIGNES DE L AUGE,B073,89000,89295,Perrigny,89,,,89295000AL0570,,,,,,,,,,,,,0,,,,,T,terres,,,2441,3.553598,47.817417
2020-1280439,2020-07-09,000001,Vente,1401.9,,,TERRES ET VIGNES DE BREAND,B072,89000,89295,Perrigny,89,,,89295000AE0112,,,,,,,,,,,,,0,,,,,T,terres,,,1835,3.551265,47.828167
2020-1280439,2020-07-09,000001,Vente,1401.9,,,TERRES ET VIGNES DE BREAND,B072,89000,89295,Perrigny,89,,,89295000AE0558,,,,,,,,,,,,,0,,,,,T,terres,,,2169,3.54741,47.827436
2020-1280439,2020-07-09,000001,Vente,1401.9,,,TERRES ET VIGNES DE BREAND,B072,89000,89295,Perrigny,89,,,89295000AE0560,,,,,,,,,,,,,0,,,,,T,terres,,,669,3.547361,47.827138
2020-1280889,2020-09-15,000001,Vente,250000,5,B,RUE DES VENDANGES,0400,89000,89295,Perrigny,89,,,89295000AH0323,,,,,,,,,,,,,0,1,Maison,124,6,S,sols,,,557,3.54394,47.826365
2020-1280936,2020-09-23,000001,Vente,2000,280,,PRES DU BOIS BOUROTTE,B066,89000,89295,Perrigny,89,,,89295000AS0119,,,,,,,,,,,,,0,3,Dépendance,,0,VE,vergers,,,2545,3.519632,47.810407
2020-1280936,2020-09-23,000001,Vente,2000,280,,PRES DU BOIS BOUROTTE,B066,89000,89295,Perrigny,89,,,89295000AS0119,,,,,,,,,,,,,0,3,Dépendance,,0,S,sols,,,300,3.519632,47.810407
2020-1281122,2020-09-17,000001,Vente,9622.4,,,LES CROTS TAUPINS,B027,89000,89295,Perrigny,89,,,89295000AI0008,,,,,,,,,,,,,0,,,,,T,terres,,,5975,3.552762,47.826353
2020-1281122,2020-09-17,000001,Vente,9622.4,,,LES CROTS TAUPINS,B027,89000,89295,Perrigny,89,,,89295000AI0029,,,,,,,,,,,,,0,,,,,T,terres,,,1990,3.550638,47.825484
2020-1281122,2020-09-17,000001,Vente,9622.4,,,LES CROTS TAUPINS,B027,89000,89295,Perrigny,89,,,89295000AI0342,,,,,,,,,,,,,0,,,,,VE,vergers,,,1806,3.554743,47.826941
2020-1281122,2020-09-17,000001,Vente,9622.4,,,LES CROTS TAUPINS,B027,89000,89295,Perrigny,89,,,89295000AI0344,,,,,,,,,,,,,0,,,,,T,terres,,,2982,3.554659,47.826885
2020-1281122,2020-09-17,000001,Vente,9622.4,,,LES CROTS TAUPINS,B027,89000,89295,Perrigny,89,,,89295000AI0346,,,,,,,,,,,,,0,,,,,VE,vergers,,,1719,3.554471,47.826884
2020-1281122,2020-09-17,000001,Vente,9622.4,,,LES CROTS TAUPINS,B027,89000,89295,Perrigny,89,,,89295000AI0348,,,,,,,,,,,,,0,,,,,T,terres,,,2439,3.554247,47.827184
2020-1281122,2020-09-17,000001,Vente,9622.4,,,LES CROTS TAUPINS,B027,89000,89295,Perrigny,89,,,89295000AI0350,,,,,,,,,,,,,0,,,,,VE,vergers,,,1055,3.554195,47.82696
2020-1281122,2020-09-17,000001,Vente,9622.4,,,LES CROTS TAUPINS,B027,89000,89295,Perrigny,89,,,89295000AI0352,,,,,,,,,,,,,0,,,,,T,terres,,,1902,3.554057,47.826981
2020-1281122,2020-09-17,000001,Vente,9622.4,,,LES CROTS TAUPINS,B027,89000,89295,Perrigny,89,,,89295000AI0354,,,,,,,,,,,,,0,,,,,T,terres,,,10202,3.552667,47.826
2020-1281125,2020-09-17,000001,Vente,49000,,,LES CROTS TAUPINS,B027,89000,89295,Perrigny,89,,,89295000AI0119,,,,,,,,,,,,,0,,,,,T,terres,,,6134,3.551934,47.825193
2020-1281167,2020-10-16,000001,Vente,631.2,,,LA PETITE MONTAGNE,B060,89000,89295,Perrigny,89,,,89295000AN0043,,,,,,,,,,,,,0,,,,,VE,vergers,,,1052,3.545778,47.815316
2020-1281341,2020-10-29,000001,Vente,173500,,,LES CHAMPS DES ARENES,B019,89000,89295,Perrigny,89,,,89295000AI0302,,,,,,,,,,,,,0,,,,,T,terres,,,2044,3.556804,47.822243
2020-1281341,2020-10-29,000001,Vente,173500,4,,ALL DES PLATANES,0283,89000,89295,Perrigny,89,,,89295000AI0304,,,,,,,,,,,,,0,1,Maison,95,5,S,sols,,,588,3.556551,47.821919
2020-1281341,2020-10-29,000001,Vente,173500,4,,ALL DES PLATANES,0283,89000,89295,Perrigny,89,,,89295000AI0304,,,,,,,,,,,,,0,1,Maison,95,5,J,jardins,,,1396,3.556551,47.821919
2020-1281341,2020-10-29,000001,Vente,173500,,,LES CHAMPS DES ARENES,B019,89000,89295,Perrigny,89,,,89295000AI0337,,,,,,,,,,,,,0,,,,,S,sols,,,189,3.556787,47.821904
2020-1281345,2020-10-29,000002,Vente,8000,,,LES GRAINS D ARGENT,B040,89000,89295,Perrigny,89,,,89295000AN0188,,,,,,,,,,,,,0,,,,,T,terres,,,2000,3.549238,47.814954
2020-1281356,2020-10-29,000002,Vente,88333,,,L AUGE,B002,89000,89295,Perrigny,89,,,89295000AL0611,,,,,,,,,,,,,0,,,,,S,sols,,,309,3.557536,47.819607
2020-1281356,2020-10-29,000002,Vente,88333,,,L AUGE,B002,89000,89295,Perrigny,89,,,89295000AL0614,,,,,,,,,,,,,0,,,,,S,sols,,,384,3.557906,47.819738
2020-1281440,2020-10-16,000001,Vente,143000,22,,GR GRANDE RUE,0190,89000,89295,Perrigny,89,,,89295000AR0145,,,,,,,,,,,,,0,1,Maison,130,5,S,sols,,,219,3.53549,47.81997
2020-1281551,2020-10-29,000001,Vente,88333,,,L AUGE,B002,89000,89295,Perrigny,89,,,89295000AL0612,,,,,,,,,,,,,0,,,,,S,sols,,,307,3.557731,47.819731
2020-1281551,2020-10-29,000001,Vente,88333,,,L AUGE,B002,89000,89295,Perrigny,89,,,89295000AL0614,,,,,,,,,,,,,0,,,,,S,sols,,,384,3.557906,47.819738
2020-1281556,2020-10-29,000001,Vente,88334,,,L AUGE,B002,89000,89295,Perrigny,89,,,89295000AL0613,,,,,,,,,,,,,0,,,,,S,sols,,,458,3.558039,47.819951
2020-1281556,2020-10-29,000001,Vente,88334,,,L AUGE,B002,89000,89295,Perrigny,89,,,89295000AL0614,,,,,,,,,,,,,0,,,,,S,sols,,,384,3.557906,47.819738
2020-1281719,2020-11-12,000001,Vente,2150,,,LES BOIS CLAIRS,B007,89000,89295,Perrigny,89,,,89295000AV0034,,,,,,,,,,,,,0,,,,,BT,taillis simples,,,2703,3.501847,47.827268
2020-1281719,2020-11-12,000001,Vente,2150,,,LES BOIS CLAIRS,B007,89000,89295,Perrigny,89,,,89295000AV0038,,,,,,,,,,,,,0,,,,,BT,taillis simples,,,2863,3.503075,47.827315
2020-1281754,2020-12-08,000001,Vente,5000,,,LES PRES DE MOCQUESOURIS,B065,89000,89295,Perrigny,89,,,89295000AM0009,,,,,,,,,,,,,0,,,,,BT,taillis simples,,,2018,3.544355,47.812111
2020-1281754,2020-12-08,000001,Vente,5000,,,LES PRES DE MOCQUESOURIS,B065,89000,89295,Perrigny,89,,,89295000AM0010,,,,,,,,,,,,,0,,,,,BT,taillis simples,,,2045,3.54386,47.812193
2020-1281754,2020-12-08,000001,Vente,5000,,,LES PRES DE MOCQUESOURIS,B065,89000,89295,Perrigny,89,,,89295000AM0012,,,,,,,,,,,,,0,,,,,BT,taillis simples,,,3468,3.544411,47.810403
2020-1281754,2020-12-08,000001,Vente,5000,,,LES PRES DE MOCQUESOURIS,B065,89000,89295,Perrigny,89,,,89295000AM0013,,,,,,,,,,,,,0,,,,,BS,taillis sous futaie,,,3452,3.545476,47.810458
2020-1281936,2020-12-17,000001,Vente,1500,,,BOIS BOUROTTE,B006,89000,89295,Perrigny,89,,,89295000AS0017,,,,,,,,,,,,,0,,,,,BT,taillis simples,,,4221,3.520833,47.813866
2020-1282039,2020-12-21,000002,Vente,1590,,,LES MONNOTTES,B049,89000,89295,Perrigny,89,,,89295000AH0501,,,,,,,,,,,,,0,,,,,P,prés,,,530,3.545489,47.823869
