id_mutation,date_mutation,numero_disposition,nature_mutation,valeur_fonciere,adresse_numero,adresse_suffixe,adresse_nom_voie,adresse_code_voie,code_postal,code_commune,nom_commune,code_departement,ancien_code_commune,ancien_nom_commune,id_parcelle,ancien_id_parcelle,numero_volume,lot1_numero,lot1_surface_carrez,lot2_numero,lot2_surface_carrez,lot3_numero,lot3_surface_carrez,lot4_numero,lot4_surface_carrez,lot5_numero,lot5_surface_carrez,nombre_lots,code_type_local,type_local,surface_reelle_bati,nombre_pieces_principales,code_nature_culture,nature_culture,code_nature_culture_speciale,nature_culture_speciale,surface_terrain,longitude,latitude
2020-1282969,2020-08-28,000001,Vente,1332,,,BOIS CAVAUX,B007,89420,89300,Pisy,89,,,89300000ZR0039,,,,,,,,,,,,,0,,,,,BT,taillis simples,,,11139,4.117435,47.552634
2020-1282996,2020-09-04,000001,Vente,2500,,,LE VILLAGE,B107,89420,89300,Pisy,89,,,893000000B0496,,,,,,,,,,,,,0,,,,,T,terres,,,277,4.142235,47.555968
2020-1282996,2020-09-04,000001,Vente,2500,,,DERRIERE LE FOUR,B046,89420,89300,Pisy,89,,,89300000ZB0094,,,,,,,,,,,,,0,,,,,T,terres,,,3985,4.142585,47.556697
2020-1283069,2020-09-24,000001,Vente,2800,,,LE VILLAGE,B107,89420,89300,Pisy,89,,,893000000B0270,,,,,,,,,,,,,0,,,,,S,sols,,,540,4.145735,47.555136
2020-1283185,2020-10-07,000001,Vente,170000,,,LE VILLAGE,B107,89420,89300,Pisy,89,,,893000000B0065,,,,,,,,,,,,,0,,,,,S,sols,,,12,4.142018,47.555273
2020-1283185,2020-10-07,000001,Vente,170000,5,B,RUE D'AMONT,0015,89420,89300,Pisy,89,,,893000000B0068,,,,,,,,,,,,,0,1,Maison,30,0,S,sols,,,185,4.141846,47.555329
2020-1283185,2020-10-07,000001,Vente,170000,7,,RUE D'AMONT,0015,89420,89300,Pisy,89,,,893000000B0428,,,,,,,,,,,,,0,1,Maison,72,2,S,sols,,,507,4.14202,47.555595
2020-1283185,2020-10-07,000001,Vente,170000,5,,RUE D'AMONT,0015,89420,89300,Pisy,89,,,893000000B0473,,,,,,,,,,,,,0,1,Maison,28,1,S,sols,,,87,4.141819,47.555207
2020-1283185,2020-10-07,000001,Vente,170000,,,LE VILLAGE,B107,89420,89300,Pisy,89,,,893000000B0497,,,,,,,,,,,,,0,,,,,T,terres,,,342,4.142117,47.555685
2020-1283185,2020-10-07,000001,Vente,170000,,,LE VILLAGE,B107,89420,89300,Pisy,89,,,893000000B0501,,,,,,,,,,,,,0,,,,,S,sols,,,33,4.142083,47.555473
