id_mutation,date_mutation,numero_disposition,nature_mutation,valeur_fonciere,adresse_numero,adresse_suffixe,adresse_nom_voie,adresse_code_voie,code_postal,code_commune,nom_commune,code_departement,ancien_code_commune,ancien_nom_commune,id_parcelle,ancien_id_parcelle,numero_volume,lot1_numero,lot1_surface_carrez,lot2_numero,lot2_surface_carrez,lot3_numero,lot3_surface_carrez,lot4_numero,lot4_surface_carrez,lot5_numero,lot5_surface_carrez,nombre_lots,code_type_local,type_local,surface_reelle_bati,nombre_pieces_principales,code_nature_culture,nature_culture,code_nature_culture_speciale,nature_culture_speciale,surface_terrain,longitude,latitude
2020-1282405,2020-02-24,000001,Vente,96000,21,,GR GRANDE RUE,0080,89460,89314,Prégilbert,89,,,89314000AB0219,,,,,,,,,,,,,0,1,Maison,101,4,S,sols,,,243,3.667716,47.640995
2020-1282405,2020-02-24,000001,Vente,96000,5001,,GR GRANDE RUE,0080,89460,89314,Prégilbert,89,,,89314000AB0225,,,,,,,,,,,,,0,3,Dépendance,,0,S,sols,,,30,3.667751,47.641039
2020-1282405,2020-02-24,000001,Vente,96000,,,LE VILLAGE,B075,89460,89314,Prégilbert,89,,,89314000AB0329,,,,,,,,,,,,,0,,,,,S,sols,,,34,3.667879,47.640986
2020-1282633,2020-05-26,000001,Vente,97000,,,CHAMPS DE LA TUILERIE,B015,89460,89314,Prégilbert,89,,,89314000AB0357,,,,,,,,,,,,,0,,,,,J,jardins,,,722,3.66537,47.64331
2020-1282633,2020-05-26,000001,Vente,97000,3,,CHE DE STE PALLAYE,0115,89460,89314,Prégilbert,89,,,89314000AB0360,,,,,,,,,,,,,0,1,Maison,103,4,S,sols,,,227,3.665321,47.643155
2020-1282669,2020-05-29,000001,Vente,2505,,,CHAMP DU SALIN,B011,89460,89314,Prégilbert,89,,,89314000ZA0239,,,,,,,,,,,,,0,,,,,T,terres,,,2760,3.671272,47.641208
2020-1282669,2020-05-29,000001,Vente,2505,,,SOUS LES OBUES,B056,89460,89314,Prégilbert,89,,,89314000ZB0075,,,,,,,,,,,,,0,,,,,T,terres,,,5660,3.676396,47.637531
2020-1282669,2020-05-29,000001,Vente,2505,,,LES OBUS,B052,89460,89314,Prégilbert,89,,,89314000ZB0225,,,,,,,,,,,,,0,,,,,T,terres,,,1434,3.677742,47.633019
2020-1282669,2020-05-29,000001,Vente,2505,,,SUR LA CHUTE BLANCHE,B023,89460,89314,Prégilbert,89,,,89314000ZE0119,,,,,,,,,,,,,0,,,,,BR,futaies résineuses,PIN,Pins,3200,3.680251,47.628073
2020-1282745,2020-06-12,000001,Vente,320400,117,,CRISENON,B032,89460,89314,Prégilbert,89,,,893140000A0050,,,,,,,,,,,,,0,1,Maison,390,7,S,sols,,,3670,3.658855,47.642667
2020-1282745,2020-06-12,000001,Vente,320400,,,CRISENON,B032,89460,89314,Prégilbert,89,,,893140000A0052,,,,,,,,,,,,,0,,,,,E,eaux,ETANG,Etangs,3440,3.658663,47.642246
2020-1282745,2020-06-12,000001,Vente,320400,,,CRISENON,B032,89460,89314,Prégilbert,89,,,893140000A0125,,,,,,,,,,,,,0,,,,,VE,vergers,,,1960,3.658385,47.642167
2020-1282745,2020-06-12,000001,Vente,320400,,,CRISENON,B032,89460,89314,Prégilbert,89,,,893140000A0132,,,,,,,,,,,,,0,,,,,AG,terrains d'agrément,,,3528,3.659082,47.64225
2020-1283374,2020-11-09,000001,Vente,108200,,,LE VILLAGE,B075,89460,89314,Prégilbert,89,,,89314000AB0189,,,,,,,,,,,,,0,,,,,S,sols,,,69,3.665211,47.641934
2020-1283374,2020-11-09,000001,Vente,108200,3,,CHE DE L ABREUVOIR,0010,89460,89314,Prégilbert,89,,,89314000AB0190,,,,,,,,,,,,,0,1,Maison,126,5,S,sols,,,165,3.665326,47.641929
2020-1283374,2020-11-09,000001,Vente,108200,,,LE VILLAGE,B075,89460,89314,Prégilbert,89,,,89314000AB0450,,,,,,,,,,,,,0,,,,,VE,vergers,,,1099,3.665031,47.641872
2020-1283378,2020-11-05,000001,Vente,29000,,,LA VALLEE QUATRE ECUS,B070,89460,89314,Prégilbert,89,,,893140000D0696,,,,,,,,,,,,,0,,,,,T,terres,,,3730,3.701889,47.634927
2020-1283378,2020-11-05,000001,Vente,29000,,,LA VALLEE QUATRE ECUS,B070,89460,89314,Prégilbert,89,,,893140000D0697,,,,,,,,,,,,,0,,,,,T,terres,,,3455,3.702204,47.634843
2020-1283378,2020-11-05,000001,Vente,29000,,,LA VALLEE QUATRE ECUS,B070,89460,89314,Prégilbert,89,,,893140000D0698,,,,,,,,,,,,,0,,,,,T,terres,,,3455,3.702296,47.634945
2020-1283378,2020-11-05,000001,Vente,29000,,,LA VALLEE QUATRE ECUS,B070,89460,89314,Prégilbert,89,,,893140000D0699,,,,,,,,,,,,,0,,,,,T,terres,,,2200,3.702242,47.635131
2020-1283378,2020-11-05,000001,Vente,29000,,,LA VALLEE QUATRE ECUS,B070,89460,89314,Prégilbert,89,,,893140000D0700,,,,,,,,,,,,,0,,,,,T,terres,,,2200,3.702276,47.63522
2020-1283378,2020-11-05,000001,Vente,29000,,,LA VALLEE QUATRE ECUS,B070,89460,89314,Prégilbert,89,,,893140000D0701,,,,,,,,,,,,,0,,,,,T,terres,,,1640,3.702549,47.635116
2020-1283378,2020-11-05,000001,Vente,29000,,,LA VALLEE QUATRE ECUS,B070,89460,89314,Prégilbert,89,,,893140000D0702,,,,,,,,,,,,,0,,,,,T,terres,,,1620,3.702733,47.635067
2020-1283378,2020-11-05,000001,Vente,29000,,,LES FROMENTEES,B044,89460,89314,Prégilbert,89,,,89314000ZD0005,,,,,,,,,,,,,0,,,,,T,terres,,,11210,3.702513,47.630146
2020-1283378,2020-11-05,000001,Vente,29000,,,LES FROMENTEES,B044,89460,89314,Prégilbert,89,,,89314000ZD0005,,,,,,,,,,,,,0,,,,,T,terres,,,11210,3.702513,47.630146
2020-1283378,2020-11-05,000001,Vente,29000,,,LES FROMENTEES,B044,89460,89314,Prégilbert,89,,,89314000ZD0005,,,,,,,,,,,,,0,,,,,T,terres,,,11210,3.702513,47.630146
2020-1283419,2020-11-24,000001,Vente,93500,,,LE VILLAGE,B075,89460,89314,Prégilbert,89,,,89314000AB0186,,,,,,,,,,,,,0,,,,,VE,vergers,,,228,3.664609,47.641785
2020-1283419,2020-11-24,000001,Vente,93500,5,,CHE DE L ABREUVOIR,0010,89460,89314,Prégilbert,89,,,89314000AB0191,,,,,,,,,,,,,0,1,Maison,147,5,S,sols,,,646,3.665282,47.641775
2020-1283419,2020-11-24,000001,Vente,93500,,,SUR LES FONTAINES,B043,89460,89314,Prégilbert,89,,,893140000B0106,,,,,,,,,,,,,0,,,,,BT,taillis simples,,,265,3.666237,47.634894
2020-1283419,2020-11-24,000001,Vente,93500,,,COTE D YONNE,B027,89460,89314,Prégilbert,89,,,893140000B0301,,,,,,,,,,,,,0,,,,,L,landes,,,502,3.672672,47.628758
2020-1283419,2020-11-24,000001,Vente,93500,,,COTE D YONNE,B027,89460,89314,Prégilbert,89,,,893140000B0352,,,,,,,,,,,,,0,,,,,L,landes,,,512,3.670403,47.630154
2020-1283419,2020-11-24,000001,Vente,93500,,,LE COTA DU MITTANT,B025,89460,89314,Prégilbert,89,,,893140000C0414,,,,,,,,,,,,,0,,,,,L,landes,,,228,3.689604,47.636208
