id_mutation,date_mutation,numero_disposition,nature_mutation,valeur_fonciere,adresse_numero,adresse_suffixe,adresse_nom_voie,adresse_code_voie,code_postal,code_commune,nom_commune,code_departement,ancien_code_commune,ancien_nom_commune,id_parcelle,ancien_id_parcelle,numero_volume,lot1_numero,lot1_surface_carrez,lot2_numero,lot2_surface_carrez,lot3_numero,lot3_surface_carrez,lot4_numero,lot4_surface_carrez,lot5_numero,lot5_surface_carrez,nombre_lots,code_type_local,type_local,surface_reelle_bati,nombre_pieces_principales,code_nature_culture,nature_culture,code_nature_culture_speciale,nature_culture_speciale,surface_terrain,longitude,latitude
2020-1283658,2020-01-20,000001,Vente,61000,3,,RUE CHAUDE,0030,89110,89334,Le Val d'Ocre,89,,,893340000D0391,,,,,,,,,,,,,0,1,Maison,90,3,S,sols,,,376,3.311862,47.824689
2020-1283658,2020-01-20,000001,Vente,61000,,,LE VILLAGE ST AUBIN,B194,89110,89334,Le Val d'Ocre,89,,,893340000D0392,,,,,,,,,,,,,0,,,,,T,terres,,,1514,3.312269,47.824753
2020-1283703,2020-01-30,000001,Vente,85000,,,LE SAULT DU MOULIN,B175,89110,89334,Le Val d'Ocre,89,,,893340000D1816,,,,,,,,,,,,,0,,,,,S,sols,,,300,3.30194,47.820046
2020-1283703,2020-01-30,000001,Vente,85000,,,LE SAULT DU MOULIN,B175,89110,89334,Le Val d'Ocre,89,,,893340000D1816,,,,,,,,,,,,,0,,,,,J,jardins,,,698,3.30194,47.820046
2020-1283703,2020-01-30,000001,Vente,85000,9003,,RUE CHAUDE,0030,89110,89334,Le Val d'Ocre,89,,,893340000D1819,,,,,,,,,,,,,0,1,Maison,64,3,J,jardins,,,392,3.301802,47.819981
2020-1283703,2020-01-30,000001,Vente,85000,9003,,RUE CHAUDE,0030,89110,89334,Le Val d'Ocre,89,,,893340000D1819,,,,,,,,,,,,,0,1,Maison,64,3,S,sols,,,300,3.301802,47.819981
2020-1283703,2020-01-30,000001,Vente,85000,,,LE SAULT DU MOULIN,B175,89110,89334,Le Val d'Ocre,89,,,893340000D1820,,,,,,,,,,,,,0,,,,,S,sols,,,299,3.30173,47.819898
2020-1283703,2020-01-30,000001,Vente,85000,,,LE SAULT DU MOULIN,B175,89110,89334,Le Val d'Ocre,89,,,893340000D2052,,,,,,,,,,,,,0,,,,,T,terres,,,586,3.301616,47.819866
2020-1283703,2020-01-30,000001,Vente,85000,,,LE SAULT DU MOULIN,B175,89110,89334,Le Val d'Ocre,89,,,893340000D2052,,,,,,,,,,,,,0,,,,,S,sols,,,5,3.301616,47.819866
2020-1283789,2020-02-07,000001,Vente,40000,,,LES PRES DE PEREUX,B332,89110,89334,Le Val d'Ocre,89,,,893343560A0052,,,,,,,,,,,,,0,,,,,BP,peupleraies,,,2685,3.328878,47.814979
2020-1283789,2020-02-07,000001,Vente,40000,,,LES PRES DE PEREUX,B332,89110,89334,Le Val d'Ocre,89,,,893343560A0090,,,,,,,,,,,,,0,,,,,BP,peupleraies,,,2745,3.32929,47.815373
2020-1283789,2020-02-07,000001,Vente,40000,,,LES PRES DE FENDANCE,B331,89110,89334,Le Val d'Ocre,89,,,893343560A0104,,,,,,,,,,,,,0,,,,,BT,taillis simples,,,780,3.332055,47.817369
2020-1283789,2020-02-07,000001,Vente,40000,,,LES PRES DE FENDANCE,B331,89110,89334,Le Val d'Ocre,89,,,893343560A0105,,,,,,,,,,,,,0,,,,,BT,taillis simples,,,770,3.332237,47.817417
2020-1283789,2020-02-07,000001,Vente,40000,,,LES PRES DE FENDANCE,B331,89110,89334,Le Val d'Ocre,89,,,893343560A0131,,,,,,,,,,,,,0,,,,,P,prés,,,465,3.334594,47.819063
2020-1283789,2020-02-07,000001,Vente,40000,,,FOUSSARD,B307,89110,89334,Le Val d'Ocre,89,,,893343560A0150,,,,,,,,,,,,,0,,,,,BT,taillis simples,,,1220,3.335828,47.819331
2020-1283789,2020-02-07,000001,Vente,40000,,,FOUSSARD,B307,89110,89334,Le Val d'Ocre,89,,,893343560A0188,,,,,,,,,,,,,0,,,,,BP,peupleraies,,,1164,3.338688,47.820912
2020-1283789,2020-02-07,000001,Vente,40000,,,LE GRAND BOUILLON,B309,89110,89334,Le Val d'Ocre,89,,,893343560A0199,,,,,,,,,,,,,0,,,,,BP,peupleraies,,,1260,3.339846,47.82075
2020-1283789,2020-02-07,000001,Vente,40000,,,FENDANCE,B306,89110,89334,Le Val d'Ocre,89,,,893343560A0588,,,,,,,,,,,,,0,,,,,BT,taillis simples,,,1070,3.333247,47.814964
2020-1283877,2020-02-29,000001,Vente,174000,9,,LE VILLAGE ST AUBIN,B194,89110,89334,Le Val d'Ocre,89,,,893340000D0367,,,,,,,,,,,,,0,4,Local industriel. commercial ou assimilé,,0,T,terres,,,181,3.310598,47.822747
2020-1283877,2020-02-29,000001,Vente,174000,7,,CHEM DES PRES,0168,89110,89334,Le Val d'Ocre,89,,,893340000D3143,,,,,,,,,,,,,0,1,Maison,140,5,AG,terrains d'agrément,,,443,3.311087,47.822744
2020-1283877,2020-02-29,000001,Vente,174000,7,,CHEM DES PRES,0168,89110,89334,Le Val d'Ocre,89,,,893340000D3143,,,,,,,,,,,,,0,1,Maison,140,5,S,sols,,,475,3.311087,47.822744
2020-1283942,2020-02-27,000001,Vente,1100,,,LES PERRUCHES,B135,89110,89334,Le Val d'Ocre,89,,,893340000D1647,,,,,,,,,,,,,0,,,,,L,landes,,,823,3.312316,47.810476
2020-1283942,2020-02-27,000001,Vente,1100,,,LES PERRUCHES,B135,89110,89334,Le Val d'Ocre,89,,,893340000D1649,,,,,,,,,,,,,0,,,,,T,terres,,,412,3.311971,47.810582
2020-1283942,2020-02-27,000001,Vente,1100,,,LES PERRUCHES,B135,89110,89334,Le Val d'Ocre,89,,,893340000D1650,,,,,,,,,,,,,0,,,,,T,terres,,,468,3.311931,47.810648
2020-1283942,2020-02-27,000001,Vente,1100,,,LES MIGRENNES,B123,89110,89334,Le Val d'Ocre,89,,,89334000ZC0033,,,,,,,,,,,,,0,,,,,T,terres,,,1213,3.3116,47.808786
2020-1284151,2020-05-28,000001,Vente,5987,,,LES BERTHES,B010,89110,89334,Le Val d'Ocre,89,,,893340000Y0044,,,,,,,,,,,,,0,,,,,T,terres,,,6560,3.333923,47.835692
2020-1284151,2020-05-28,000001,Vente,5987,,,LES BERTHES,B010,89110,89334,Le Val d'Ocre,89,,,893340000Y0045,,,,,,,,,,,,,0,,,,,T,terres,,,2330,3.333693,47.835566
2020-1284151,2020-05-28,000001,Vente,5987,,,LES BERTHES,B010,89110,89334,Le Val d'Ocre,89,,,893340000Y0046,,,,,,,,,,,,,0,,,,,T,terres,,,2360,3.333395,47.835777
2020-1284306,2020-06-11,000001,Vente,155000,26,,RUE CHAUDE,0030,89110,89334,Le Val d'Ocre,89,,,893340000D0108,,,,,,,,,,,,,0,3,Dépendance,,0,S,sols,,,656,3.307241,47.823758
2020-1284306,2020-06-11,000001,Vente,155000,26,,RUE CHAUDE,0030,89110,89334,Le Val d'Ocre,89,,,893340000D0108,,,,,,,,,,,,,0,1,Maison,120,5,S,sols,,,656,3.307241,47.823758
2020-1284306,2020-06-11,000001,Vente,155000,,,HAUT DE LA RUE CHAUDE,B114,89110,89334,Le Val d'Ocre,89,,,893340000D0109,,,,,,,,,,,,,0,,,,,J,jardins,,,823,3.307081,47.823876
2020-1284306,2020-06-11,000001,Vente,155000,,,HAUT DE LA RUE CHAUDE,B114,89110,89334,Le Val d'Ocre,89,,,893340000D0113,,,,,,,,,,,,,0,,,,,T,terres,,,606,3.306645,47.824443
2020-1284306,2020-06-11,000001,Vente,155000,,,HAUT DE LA RUE CHAUDE,B114,89110,89334,Le Val d'Ocre,89,,,893340000D0115,,,,,,,,,,,,,0,,,,,T,terres,,,269,3.306925,47.82414
2020-1284306,2020-06-11,000001,Vente,155000,,,HAUT DE LA RUE CHAUDE,B114,89110,89334,Le Val d'Ocre,89,,,893340000D0116,,,,,,,,,,,,,0,,,,,T,terres,,,291,3.307006,47.824162
2020-1284306,2020-06-11,000001,Vente,155000,,,HAUT DE LA RUE CHAUDE,B114,89110,89334,Le Val d'Ocre,89,,,893340000D0117,,,,,,,,,,,,,0,,,,,T,terres,,,586,3.307,47.824313
2020-1284306,2020-06-11,000001,Vente,155000,,,HAUT DE LA RUE CHAUDE,B114,89110,89334,Le Val d'Ocre,89,,,893340000D0118,,,,,,,,,,,,,0,,,,,T,terres,,,148,3.306714,47.824561
2020-1284306,2020-06-11,000001,Vente,155000,,,HAUT DE LA RUE CHAUDE,B114,89110,89334,Le Val d'Ocre,89,,,893340000D0128,,,,,,,,,,,,,0,,,,,L,landes,,,413,3.307168,47.824325
2020-1284306,2020-06-11,000001,Vente,155000,,,HAUT DE LA RUE CHAUDE,B114,89110,89334,Le Val d'Ocre,89,,,893340000D2007,,,,,,,,,,,,,0,,,,,T,terres,,,135,3.306466,47.82442
2020-1284306,2020-06-11,000001,Vente,155000,,,HAUT DE LA RUE CHAUDE,B114,89110,89334,Le Val d'Ocre,89,,,893340000D2008,,,,,,,,,,,,,0,,,,,T,terres,,,292,3.306828,47.824125
2020-1284413,2020-07-21,000001,Vente,2086,,,FOUSSARD,B307,89110,89334,Le Val d'Ocre,89,,,893343560A0152,,,,,,,,,,,,,0,,,,,T,terres,,,1469,3.336892,47.819313
2020-1284413,2020-07-21,000001,Vente,2086,,,FOUSSARD,B307,89110,89334,Le Val d'Ocre,89,,,893343560A0153,,,,,,,,,,,,,0,,,,,BT,taillis simples,,,600,3.335689,47.818946
2020-1284413,2020-07-21,000001,Vente,2086,,,LE PRE SALE,B330,89110,89334,Le Val d'Ocre,89,,,893343560A0813,,,,,,,,,,,,,0,,,,,BT,taillis simples,,,1362,3.345842,47.822321
2020-1284413,2020-07-21,000001,Vente,2086,,,PITANCE,B326,89110,89334,Le Val d'Ocre,89,,,89334356ZB0023,,,,,,,,,,,,,0,,,,,BT,taillis simples,,,850,3.346607,47.817642
2020-1284413,2020-07-21,000001,Vente,2086,,,CHOLIFER,B065,89110,89334,Le Val d'Ocre,89,,,893340000C0104,,,,,,,,,,,,,0,,,,,BT,taillis simples,,,285,3.344509,47.824726
2020-1284591,2020-08-25,000001,Vente,170000,,,LE VILLAGE ST AUBIN,B194,89110,89334,Le Val d'Ocre,89,,,893340000D0393,,,,,,,,,,,,,0,,,,,T,terres,,,1975,3.312559,47.824637
2020-1284591,2020-08-25,000001,Vente,170000,1,,RUE CHAUDE,0030,89110,89334,Le Val d'Ocre,89,,,893340000D0394,,,,,,,,,,,,,0,1,Maison,190,6,S,sols,,,964,3.313052,47.824907
2020-1284853,2020-10-09,000001,Vente,1692,,,LE CHEMIN DE GUERCHY,B059,89110,89334,Le Val d'Ocre,89,,,893340000Y0191,,,,,,,,,,,,,0,,,,,T,terres,,,5640,3.328543,47.826412
2020-1284965,2020-10-26,000001,Vente,60000,2,,RUE DE ST MARTIN ST MARTIN OCR,0227,89110,89334,Le Val d'Ocre,89,,,893343560A0524,,,,,,,,,,,,,0,1,Maison,43,1,T,terres,,,2037,3.339898,47.818767
2020-1284965,2020-10-26,000001,Vente,60000,2,,RUE DE ST MARTIN ST MARTIN OCR,0227,89110,89334,Le Val d'Ocre,89,,,893343560A0524,,,,,,,,,,,,,0,1,Maison,43,1,S,sols,,,1037,3.339898,47.818767
2020-1285156,2020-10-30,000001,Vente,450,,,LE VILLAGE ST MARTIN S/OCR,B342,89110,89334,Le Val d'Ocre,89,,,893343560A0470,,,,,,,,,,,,,0,,,,,P,prés,,,1748,3.341781,47.81629
