id_mutation,date_mutation,numero_disposition,nature_mutation,valeur_fonciere,adresse_numero,adresse_suffixe,adresse_nom_voie,adresse_code_voie,code_postal,code_commune,nom_commune,code_departement,ancien_code_commune,ancien_nom_commune,id_parcelle,ancien_id_parcelle,numero_volume,lot1_numero,lot1_surface_carrez,lot2_numero,lot2_surface_carrez,lot3_numero,lot3_surface_carrez,lot4_numero,lot4_surface_carrez,lot5_numero,lot5_surface_carrez,nombre_lots,code_type_local,type_local,surface_reelle_bati,nombre_pieces_principales,code_nature_culture,nature_culture,code_nature_culture_speciale,nature_culture_speciale,surface_terrain,longitude,latitude
2020-1282514,2020-03-27,000001,Vente,159530,1,,RUE DES NOISETIERS,0057,89420,89412,Thizy,89,,,89412000AB0381,,,,,,,,,,,,,0,1,Maison,85,4,S,sols,,,1198,4.052641,47.568884
2020-1282525,2020-04-10,000001,Vente,105000,,,LE VILLAGE,B057,89420,89412,Thizy,89,,,89412000AB0022,,,,,,,,,,,,,0,,,,,T,terres,,,814,4.057023,47.571627
2020-1282525,2020-04-10,000001,Vente,105000,4,,RUE EDME MARIE CADOUX,0040,89420,89412,Thizy,89,,,89412000AB0023,,,,,,,,,,,,,0,1,Maison,95,3,S,sols,,,995,4.057154,47.571118
2020-1282525,2020-04-10,000001,Vente,105000,4,,RUE EDME MARIE CADOUX,0040,89420,89412,Thizy,89,,,89412000AB0023,,,,,,,,,,,,,0,1,Maison,75,3,S,sols,,,995,4.057154,47.571118
2020-1282525,2020-04-10,000001,Vente,105000,,,LE VILLAGE,B057,89420,89412,Thizy,89,,,89412000AB0313,,,,,,,,,,,,,0,,,,,T,terres,,,558,4.056862,47.57159
2020-1283096,2020-09-03,000001,Vente,16290,,,CHAMPS RABUTIN,B024,89420,89412,Thizy,89,,,894120000D0254,,,,,,,,,,,,,0,,,,,AB,terrains a bâtir,,,1086,4.050121,47.567575
2020-1283138,2020-09-25,000001,Vente,7125,,,LE VILLAGE,B057,89420,89412,Thizy,89,,,89412000AB0394,,,,,,,,,,,,,0,,,,,AB,terrains a bâtir,,,475,4.051202,47.56837
2020-1283504,2020-12-15,000001,Vente,68000,,,LE VILLAGE,B057,89420,89412,Thizy,89,,,89412000AB0205,,,,,,,,,,,,,0,,,,,T,terres,,,380,4.054638,47.570157
2020-1283504,2020-12-15,000001,Vente,68000,,,LE VILLAGE,B057,89420,89412,Thizy,89,,,89412000AB0206,,,,,,,,,,,,,0,,,,,P,prés,,,687,4.054509,47.57025
2020-1283504,2020-12-15,000001,Vente,68000,3,,RLE DU PERE CHICANNE,0080,89420,89412,Thizy,89,,,89412000AB0302,,,,,,,,,,,,,0,3,Dépendance,,0,S,sols,,,361,4.054833,47.570398
2020-1283504,2020-12-15,000001,Vente,68000,,,LE VILLAGE,B057,89420,89412,Thizy,89,,,89412000AB0304,,,,,,,,,,,,,0,,,,,S,sols,,,32,4.054945,47.570425
2020-1283504,2020-12-15,000001,Vente,68000,3,,RLE DU PERE CHICANNE,0080,89420,89412,Thizy,89,,,89412000AB0353,,,,,,,,,,,,,0,1,Maison,51,3,S,sols,,,131,4.054909,47.570511
2020-1283505,2020-12-04,000001,Vente,280000,,,LE VILLAGE,B057,89420,89412,Thizy,89,,,89412000AB0040,,,,,,,,,,,,,0,,,,,T,terres,,,2350,4.057664,47.571871
2020-1283505,2020-12-04,000001,Vente,280000,,,LE VILLAGE,B057,89420,89412,Thizy,89,,,89412000AB0098,,,,,,,,,,,,,0,,,,,T,terres,,,45,4.061087,47.571267
2020-1283505,2020-12-04,000001,Vente,280000,,,LE VILLAGE,B057,89420,89412,Thizy,89,,,89412000AB0289,,,,,,,,,,,,,0,,,,,T,terres,,,982,4.057865,47.572012
2020-1283505,2020-12-04,000001,Vente,280000,,,BUISSON BAUDE,B008,89420,89412,Thizy,89,,,894120000B0047,,,,,,,,,,,,,0,,,,,BT,taillis simples,,,1297,4.05401,47.589167
2020-1283505,2020-12-04,000001,Vente,280000,,,BUISSON BAUDE,B008,89420,89412,Thizy,89,,,894120000B0115,,,,,,,,,,,,,0,,,,,L,landes,,,1200,4.059436,47.595639
2020-1283505,2020-12-04,000001,Vente,280000,,,BUISSON BAUDE,B008,89420,89412,Thizy,89,,,894120000B0116,,,,,,,,,,,,,0,,,,,L,landes,,,4197,4.05936,47.595955
2020-1283505,2020-12-04,000001,Vente,280000,,,BUISSON BAUDE,B008,89420,89412,Thizy,89,,,894120000B0122,,,,,,,,,,,,,0,,,,,T,terres,,,3830,4.060623,47.596247
2020-1283505,2020-12-04,000001,Vente,280000,,,CHAUMES HT D AU DELA DE L,B027,89420,89412,Thizy,89,,,894120000D0144,,,,,,,,,,,,,0,,,,,T,terres,,,39,4.063936,47.558282
2020-1283505,2020-12-04,000001,Vente,280000,,,CHAMPS DES AVOINES,B018,89420,89412,Thizy,89,,,894120000W0006,,,,,,,,,,,,,0,,,,,T,terres,,,510,4.059314,47.566808
2020-1283505,2020-12-04,000001,Vente,280000,,,AU DELA DE L EAU,B036,89420,89412,Thizy,89,,,894120000W0028,,,,,,,,,,,,,0,,,,,T,terres,,,600,4.0638,47.558282
2020-1283505,2020-12-04,000001,Vente,280000,,,CHEMIN DE MARMEAUX,B028,89420,89412,Thizy,89,,,894120000X0001,,,,,,,,,,,,,0,,,,,T,terres,,,4710,4.057522,47.584911
2020-1283505,2020-12-04,000001,Vente,280000,,,BONNE COUR,B005,89420,89412,Thizy,89,,,894120000X0037,,,,,,,,,,,,,0,,,,,T,terres,,,7930,4.061117,47.579997
2020-1283505,2020-12-04,000001,Vente,280000,,,LES AUBUES,B001,89420,89412,Thizy,89,,,894120000X0087,,,,,,,,,,,,,0,,,,,T,terres,,,7330,4.054293,47.573452
2020-1283505,2020-12-04,000001,Vente,280000,,,CHAMP TOURNIER,B020,89420,89412,Thizy,89,,,894120000Y0046,,,,,,,,,,,,,0,,,,,T,terres,,,7020,4.054862,47.587289
2020-1283505,2020-12-04,000001,Vente,280000,,,COME L AMIRAL,B031,89420,89412,Thizy,89,,,894120000Y0061,,,,,,,,,,,,,0,,,,,T,terres,,,12540,4.061614,47.588981
