id_mutation,date_mutation,numero_disposition,nature_mutation,valeur_fonciere,adresse_numero,adresse_suffixe,adresse_nom_voie,adresse_code_voie,code_postal,code_commune,nom_commune,code_departement,ancien_code_commune,ancien_nom_commune,id_parcelle,ancien_id_parcelle,numero_volume,lot1_numero,lot1_surface_carrez,lot2_numero,lot2_surface_carrez,lot3_numero,lot3_surface_carrez,lot4_numero,lot4_surface_carrez,lot5_numero,lot5_surface_carrez,nombre_lots,code_type_local,type_local,surface_reelle_bati,nombre_pieces_principales,code_nature_culture,nature_culture,code_nature_culture_speciale,nature_culture_speciale,surface_terrain,longitude,latitude
2020-1312710,2020-01-03,000001,Vente en l'état futur d'achèvement,317655,35,,RUE DES MINIMES,6170,92400,92026,Courbevoie,92,,,92026000AP0033,,,3118,,,,,,,,,,1,3,Dépendance,,0,,,,,,2.261859,48.905213
2020-1312710,2020-01-03,000001,Vente en l'état futur d'achèvement,317655,35,,RUE DES MINIMES,6170,92400,92026,Courbevoie,92,,,92026000AP0033,,,10009,,,,,,,,,,1,2,Appartement,64,3,,,,,,2.261859,48.905213
2020-1312713,2020-01-02,000001,Vente,391000,80,,RUE DE NORMANDIE,6670,92400,92026,Courbevoie,92,,,920260000H0198,,,295,,,,,,,,,,1,3,Dépendance,,0,,,,,,2.24375,48.899631
2020-1312713,2020-01-02,000001,Vente,391000,43,,AV MARCEAU,6120,92400,92026,Courbevoie,92,,,920260000H0198,,,433,48.23,532,,,,,,,,2,2,Appartement,49,2,,,,,,2.24375,48.899631
2020-1312716,2020-01-08,000001,Vente en l'état futur d'achèvement,514000,35,,RUE DES MINIMES,6170,92400,92026,Courbevoie,92,,,92026000AP0033,,,1007,,,,,,,,,,1,2,Appartement,67,3,,,,,,2.261859,48.905213
2020-1312716,2020-01-08,000001,Vente en l'état futur d'achèvement,514000,35,,RUE DES MINIMES,6170,92400,92026,Courbevoie,92,,,92026000AP0033,,,3168,,,,,,,,,,1,3,Dépendance,,0,,,,,,2.261859,48.905213
2020-1312721,2020-01-02,000001,Vente,266500,63,,RUE EUGENE CARON,3180,92400,92026,Courbevoie,92,,,920260000F0094,,,16,,37,38.36,,,,,,,2,2,Appartement,37,1,,,,,,2.243307,48.896489
2020-1312723,2020-01-09,000001,Vente,342100,44,,RUE DE BITCHE,0650,92400,92026,Courbevoie,92,,,920260000U0040,,,50,,,,,,,,,,1,3,Dépendance,,0,,,,,,2.246671,48.896597
2020-1312723,2020-01-09,000001,Vente,342100,44,,RUE DE BITCHE,0650,92400,92026,Courbevoie,92,,,920260000U0040,,,46,,7,52.37,,,,,,,2,2,Appartement,52,2,,,,,,2.246671,48.896597
2020-1312725,2020-01-02,000001,Vente,395300,5,,BD GEORGES CLEMENCEAU,4150,92400,92026,Courbevoie,92,,,92026000AX0029,,,82,62.1,99,,,,,,,,2,2,Appartement,65,3,,,,,,2.273812,48.902551
2020-1312727,2020-01-10,000001,Vente,615000,27,,RUE EUGENE CARON,3180,92400,92026,Courbevoie,92,,,920260000G0177,,,6,,,,,,,,,,1,3,Dépendance,,0,,,,,,2.245179,48.897263
2020-1312727,2020-01-10,000001,Vente,615000,27,,RUE EUGENE CARON,3180,92400,92026,Courbevoie,92,,,920260000G0177,,,2,118.85,3,118.85,,,,,,,2,2,Appartement,110,5,,,,,,2.245179,48.897263
2020-1312728,2020-01-06,000001,Vente,365000,10,T,RUE DES LILAS D ESPAGNE,5163,92400,92026,Courbevoie,92,,,920260000D0572,,,4144,,,,,,,,,,1,3,Dépendance,,0,,,,,,2.236475,48.898093
2020-1312728,2020-01-06,000001,Vente,365000,14,,RUE DES LILAS D ESPAGNE,5163,92400,92026,Courbevoie,92,,,920260000D0572,,,2021,50.71,2110,,,,,,,,2,2,Appartement,50,2,,,,,,2.236475,48.898093
2020-1312729,2020-01-10,000001,Vente,540000,179,,BD SAINT DENIS,8620,92400,92026,Courbevoie,92,,,92026000AZ0149,,,171,,,,,,,,,,1,3,Dépendance,,0,,,,,,2.267729,48.900131
2020-1312729,2020-01-10,000001,Vente,540000,173,,BD SAINT DENIS,8620,92400,92026,Courbevoie,92,,,92026000AZ0149,,,13,66.85,92,,,,,,,,2,2,Appartement,66,3,,,,,,2.267729,48.900131
2020-1312730,2020-01-09,000001,Vente en l'état futur d'achèvement,355000,,,,,,92026,Courbevoie,92,,,920260000F0021,,,16,,,,,,,,,,1,,,,,,,,,,2.241754,48.897155
2020-1312731,2020-01-08,000001,Vente en l'état futur d'achèvement,599900,,,,,,92026,Courbevoie,92,,,920260000F0021,,,27,,,,,,,,,,1,,,,,,,,,,2.241754,48.897155
2020-1312731,2020-01-08,000001,Vente en l'état futur d'achèvement,599900,,,,,,92026,Courbevoie,92,,,920260000F0021,,,9,,,,,,,,,,1,,,,,,,,,,2.241754,48.897155
2020-1312734,2020-01-10,000001,Vente,243173,82,,RUE DE COLOMBES,1545,92400,92026,Courbevoie,92,,,920260000O0099,,,24,32.61,46,,,,,,,,2,2,Appartement,29,2,,,,,,2.256348,48.902571
2020-1312743,2020-01-07,000001,Vente,234000,9,,RUE DE LA MUTUALITE,6195,92400,92026,Courbevoie,92,,,920260000Y0176,,,10,33.58,,,,,,,,,1,2,Appartement,34,2,,,,,,2.245561,48.893706
2020-1312748,2020-01-10,000001,Vente,412800,5,,RUE DE LA SABLIERE,8510,92400,92026,Courbevoie,92,,,92026000AU0184,,,62,60.32,8,,,,,,,,2,2,Appartement,60,2,,,,,,2.273435,48.907729
2020-1312748,2020-01-10,000001,Vente,412800,5,,RUE DE LA SABLIERE,8510,92400,92026,Courbevoie,92,,,92026000AU0184,,,30,,,,,,,,,,1,3,Dépendance,,0,,,,,,2.273435,48.907729
2020-1312749,2020-01-06,000001,Vente en l'état futur d'achèvement,610000,,,,,,92026,Courbevoie,92,,,920260000F0021,,,17,,,,,,,,,,1,,,,,,,,,,2.241754,48.897155
2020-1312749,2020-01-06,000001,Vente en l'état futur d'achèvement,610000,,,,,,92026,Courbevoie,92,,,920260000F0021,,,29,,,,,,,,,,1,,,,,,,,,,2.241754,48.897155
2020-1312752,2020-01-10,000001,Vente,113800,11,,ALL DES TILLEULS,9046,92400,92026,Courbevoie,92,,,920260000C0362,,,21,18.06,,,,,,,,,1,4,Local industriel. commercial ou assimilé,17,0,,,,,,2.236266,48.898935
2020-1312757,2020-01-13,000001,Vente en l'état futur d'achèvement,452000,35,,RUE DES MINIMES,6170,92400,92026,Courbevoie,92,,,92026000AP0033,,,1011,,,,,,,,,,1,2,Appartement,58,3,,,,,,2.261859,48.905213
2020-1312757,2020-01-13,000001,Vente en l'état futur d'achèvement,452000,35,,RUE DES MINIMES,6170,92400,92026,Courbevoie,92,,,92026000AP0033,,,3140,,,,,,,,,,1,3,Dépendance,,0,,,,,,2.261859,48.905213
2020-1312758,2020-01-09,000001,Vente en l'état futur d'achèvement,320000,35,,RUE DES MINIMES,6170,92400,92026,Courbevoie,92,,,92026000AP0033,,,10020,65.08,,,,,,,,,1,2,Appartement,65,3,,,,,,2.261859,48.905213
2020-1312763,2020-01-10,000001,Vente en l'état futur d'achèvement,362000,,,,,,92026,Courbevoie,92,,,920260000F0021,,,18,,,,,,,,,,1,,,,,,,,,,2.241754,48.897155
2020-1312764,2020-01-16,000001,Vente en l'état futur d'achèvement,339000,,,,,,92026,Courbevoie,92,,,920260000F0021,,,12,,,,,,,,,,1,,,,,,,,,,2.241754,48.897155
2020-1312772,2020-01-20,000001,Vente,114000,25,,RUE VICTOR HUGO,9641,92400,92026,Courbevoie,92,,,92026000AH0076,,,12,21.06,28,,,,,,,,2,2,Appartement,21,1,,,,,,2.255206,48.893346
2020-1312783,2020-01-10,000001,Vente,595000,51,,AV PASTEUR,7130,92400,92026,Courbevoie,92,,,92026000AT0037,,,35,85,,,,,,,,,1,2,Appartement,79,4,,,,,,2.268855,48.904608
2020-1312789,2020-01-07,000001,Vente,421280,9,,AV PUVIS DE CHAVANNES,7184,92400,92026,Courbevoie,92,,,920260000B0332,,,228,59.72,387,,,,,,,,2,2,Appartement,59,3,,,,,,2.233893,48.899038
2020-1312789,2020-01-07,000001,Vente,421280,7,B,AV PUVIS DE CHAVANNES,7184,92400,92026,Courbevoie,92,,,920260000B0332,,,341,,,,,,,,,,1,3,Dépendance,,0,,,,,,2.233893,48.899038
2020-1312799,2020-01-03,000001,Vente,657960,10,,RUE DU 22 SEPTEMBRE,9665,92400,92026,Courbevoie,92,,,92026000AY0025,,,47,76.9,,,,,,,,,1,2,Appartement,79,3,,,,,,2.268869,48.903595
2020-1312799,2020-01-03,000001,Vente,657960,10,,RUE DU 22 SEPTEMBRE,9665,92400,92026,Courbevoie,92,,,92026000AY0025,,,68,,,,,,,,,,1,3,Dépendance,,0,,,,,,2.268869,48.903595
2020-1312800,2020-01-24,000001,Vente,600000,58,,RUE DU CAPITAINE GUYNEMER,1440,92400,92026,Courbevoie,92,,,920260000U0068,,,,,,,,,,,,,0,2,Appartement,47,2,S,sols,,,388,2.245445,48.896272
2020-1312800,2020-01-24,000001,Vente,600000,58,,RUE DU CAPITAINE GUYNEMER,1440,92400,92026,Courbevoie,92,,,920260000U0068,,,,,,,,,,,,,0,3,Dépendance,,0,S,sols,,,388,2.245445,48.896272
2020-1312800,2020-01-24,000001,Vente,600000,58,,RUE DU CAPITAINE GUYNEMER,1440,92400,92026,Courbevoie,92,,,920260000U0068,,,,,,,,,,,,,0,2,Appartement,125,3,S,sols,,,388,2.245445,48.896272
2020-1312801,2020-01-21,000001,Vente,29000,29,,BD GEORGES CLEMENCEAU,4150,92400,92026,Courbevoie,92,,,92026000AY0241,,,274,,,,,,,,,,1,3,Dépendance,,0,,,,,,2.272113,48.90226
2020-1312803,2020-01-17,000001,Vente,490430,33,,BD SAINT DENIS,8620,92400,92026,Courbevoie,92,,,92026000AK0151,,,155,,320,68.57,,,,,,,2,2,Appartement,70,4,,,,,,2.260078,48.897352
2020-1312805,2020-01-16,000001,Vente,263000,153,,RUE ARMAND SILVESTRE,0078,92400,92026,Courbevoie,92,,,92026000AX0012,,,42,,94,39.14,,,,,,,2,2,Appartement,39,2,,,,,,2.272693,48.9044
2020-1312805,2020-01-16,000001,Vente,263000,153,,RUE ARMAND SILVESTRE,0078,92400,92026,Courbevoie,92,,,92026000AX0012,,,86,,,,,,,,,,1,3,Dépendance,,0,,,,,,2.272693,48.9044
2020-1312812,2020-01-14,000001,Vente,200000,64,,BD MISSION MARCHAND,6175,92400,92026,Courbevoie,92,,,920260000H0215,,,23,26.21,96,,,,,,,,2,2,Appartement,26,1,,,,,,2.240658,48.899579
2020-1312812,2020-01-14,000001,Vente,200000,66,,BD MISSION MARCHAND,6175,92400,92026,Courbevoie,92,,,920260000H0215,,,137,,,,,,,,,,1,3,Dépendance,,0,,,,,,2.240658,48.899579
2020-1312824,2020-01-07,000001,Vente,266968.94,17,,RUE JULES LEFEVRE,4790,92400,92026,Courbevoie,92,,,92026000AK0191,,,204,23.47,,,,,,,,,1,4,Local industriel. commercial ou assimilé,25,0,,,,,,2.258765,48.897213
2020-1312825,2020-01-07,000001,Vente,266566.03,17,,RUE JULES LEFEVRE,4790,92400,92026,Courbevoie,92,,,92026000AK0191,,,171,23.1,,,,,,,,,1,4,Local industriel. commercial ou assimilé,22,0,,,,,,2.258765,48.897213
2020-1312830,2020-01-28,000001,Vente,516000,44,,RUE DE BITCHE,0650,92400,92026,Courbevoie,92,,,920260000U0040,,,48,,,,,,,,,,1,3,Dépendance,,0,,,,,,2.246671,48.896597
2020-1312830,2020-01-28,000001,Vente,516000,44,,RUE DE BITCHE,0650,92400,92026,Courbevoie,92,,,920260000U0040,,,2,67.37,24,,,,,,,,2,2,Appartement,67,3,,,,,,2.246671,48.896597
2020-1312831,2020-01-27,000001,Vente,475500,38,,BD DE LA PAIX,7110,92400,92026,Courbevoie,92,,,92026000AS0219,,,676,,,,,,,,,,1,3,Dépendance,,0,,,,,,2.266615,48.902226
2020-1312831,2020-01-27,000001,Vente,475500,52,,BD DE LA PAIX,7110,92400,92026,Courbevoie,92,,,92026000AS0219,,,133,66.85,134,,,,,,,,2,2,Appartement,65,3,,,,,,2.266615,48.902226
2020-1312833,2020-01-06,000001,Vente,1205285,199,,RUE JEAN BAPTISTE CHARCOT,4720,92400,92026,Courbevoie,92,,,92026000BH0035,,,5,,,,,,,,,,1,3,Dépendance,,0,,,,,,2.27905,48.903612
2020-1312833,2020-01-06,000001,Vente,1205285,208,,RUE JEAN BAPTISTE CHARCOT,4720,92400,92026,Courbevoie,92,,,92026000BJ0060,,,,,,,,,,,,,0,1,Maison,116,8,S,sols,,,230,2.280093,48.903472
2020-1312834,2020-01-10,000001,Vente,481700,3,,RUE SAINT GUILLAUME,8836,92400,92026,Courbevoie,92,,,92026000BJ0073,,,158,69.77,92,,,,,,,,2,3,Dépendance,,0,,,,,,2.280822,48.902651
2020-1312834,2020-01-10,000001,Vente,481700,3,,RUE SAINT GUILLAUME,8836,92400,92026,Courbevoie,92,,,92026000BJ0073,,,6,,,,,,,,,,1,3,Dépendance,,0,,,,,,2.280822,48.902651
2020-1312834,2020-01-10,000001,Vente,481700,3,,RUE SAINT GUILLAUME,8836,92400,92026,Courbevoie,92,,,92026000BJ0073,,,159,67.77,69,,,,,,,,2,2,Appartement,50,2,,,,,,2.280822,48.902651
2020-1312840,2020-01-20,000001,Vente,605000,19,,RUE VICTOR HUGO,9641,92400,92026,Courbevoie,92,,,92026000AH0181,,,1066,,1178,,,,,,,,2,2,Appartement,92,4,,,,,,2.254769,48.893303
2020-1312840,2020-01-20,000001,Vente,605000,23,,RUE VICTOR HUGO,9641,92400,92026,Courbevoie,92,,,92026000AH0181,,,1238,,,,,,,,,,1,3,Dépendance,,0,,,,,,2.254769,48.893303
2020-1312840,2020-01-20,000001,Vente,605000,23,,RUE VICTOR HUGO,9641,92400,92026,Courbevoie,92,,,92026000AH0181,,,1233,,,,,,,,,,1,3,Dépendance,,0,,,,,,2.254769,48.893303
2020-1312851,2020-01-27,000001,Vente,355000,3,,PL CHARRAS,1520,92400,92026,Courbevoie,92,,,920260000Z0130,,,562,,,,,,,,,,1,3,Dépendance,,0,,,,,,2.250815,48.893931
2020-1312851,2020-01-27,000001,Vente,355000,3,,PL CHARRAS,1520,92400,92026,Courbevoie,92,,,920260000Z0130,,,458,45.1,,,,,,,,,1,2,Appartement,45,2,,,,,,2.250815,48.893931
2020-1312852,2020-01-09,000001,Vente,409000,37,,RUE JULES FERRY,4785,92400,92026,Courbevoie,92,,,92026000BC0180,,,119,,,,,,,,,,1,3,Dépendance,,0,,,,,,2.264796,48.900013
2020-1312852,2020-01-09,000001,Vente,409000,37,,RUE JULES FERRY,4785,92400,92026,Courbevoie,92,,,92026000BC0180,,,33,49.81,,,,,,,,,1,2,Appartement,49,2,,,,,,2.264796,48.900013
2020-1312861,2020-01-03,000001,Vente,662300,7,,RUE DE LA SABLIERE,8510,92400,92026,Courbevoie,92,,,92026000AU0035,,,12,94.32,13,,42,,43,,,,4,2,Appartement,92,4,,,,,,2.272968,48.907573
2020-1312861,2020-01-03,000001,Vente,662300,7,,RUE DE LA SABLIERE,8510,92400,92026,Courbevoie,92,,,92026000AU0035,,,27,,,,,,,,,,1,3,Dépendance,,0,,,,,,2.272968,48.907573
2020-1312863,2020-01-16,000001,Vente,995000,9,,PAS EUGENE BARBIER,3170,92400,92026,Courbevoie,92,,,920260000I0392,,,,,,,,,,,,,0,4,Local industriel. commercial ou assimilé,38,0,S,sols,,,354,2.242466,48.90179
2020-1312863,2020-01-16,000001,Vente,995000,9,,PAS EUGENE BARBIER,3170,92400,92026,Courbevoie,92,,,920260000I0392,,,,,,,,,,,,,0,1,Maison,150,4,S,sols,,,354,2.242466,48.90179
2020-1312868,2020-01-22,000001,Vente,372500,11,,RUE GAULTIER,4130,92400,92026,Courbevoie,92,,,920260000H0041,,,9,103.48,,,,,,,,,1,2,Appartement,103,4,,,,,,2.240982,48.898235
2020-1312870,2020-01-10,000001,Vente,1618513,23,,RUE DES MINIMES,6170,92400,92026,Courbevoie,92,,,92026000AP0045,,,,,,,,,,,,,0,1,Maison,103,3,S,sols,,,330,,
2020-1312870,2020-01-10,000001,Vente,1618513,23,,RUE DES MINIMES,6170,92400,92026,Courbevoie,92,,,92026000AP0045,,,,,,,,,,,,,0,1,Maison,208,10,S,sols,,,330,,
2020-1312871,2020-01-15,000001,Vente en l'état futur d'achèvement,557000,6,,RUE GAULTIER,4130,92400,92026,Courbevoie,92,,,920260000F0008,,,20,,,,,,,,,,1,,,,,,,,,,2.240783,48.897818
2020-1312871,2020-01-15,000001,Vente en l'état futur d'achèvement,557000,6,,RUE GAULTIER,4130,92400,92026,Courbevoie,92,,,920260000F0008,,,47,,,,,,,,,,1,,,,,,,,,,2.240783,48.897818
2020-1312871,2020-01-15,000001,Vente en l'état futur d'achèvement,557000,6,,RUE GAULTIER,4130,92400,92026,Courbevoie,92,,,920260000F0008,,,58,,,,,,,,,,1,,,,,,,,,,2.240783,48.897818
2020-1312875,2020-01-17,000001,Vente,340000,2,B,RUE ROUGET DE L ISLE,8170,92400,92026,Courbevoie,92,,,920260000S0163,,,4245,,,,,,,,,,1,3,Dépendance,,0,,,,,,2.251428,48.89807
2020-1312875,2020-01-17,000001,Vente,340000,5,,VLA DE LA MUSIQUE,6194,92400,92026,Courbevoie,92,,,920260000S0163,,,4324,,4365,49.12,,,,,,,2,2,Appartement,47,2,,,,,,2.251428,48.89807
2020-1312876,2020-01-28,000001,Vente,209000,22,,BD DE LA PAIX,7110,92400,92026,Courbevoie,92,,,92026000AR0106,,,1051,26.2,,,,,,,,,1,2,Appartement,25,1,,,,,,2.263835,48.900903
2020-1312878,2020-01-15,000001,Vente,395000,21,,RUE EUGENE CARON,3180,92400,92026,Courbevoie,92,,,920260000G0093,,,51,,64,,,,,,,,2,2,Appartement,55,3,,,,,,2.245656,48.89746
2020-1312879,2020-01-27,000001,Vente,625000,7,,RUE JEAN BAPTISTE CHARCOT,4720,92400,92026,Courbevoie,92,,,92026000BD0199,,,234,,5,84.95,,,,,,,2,2,Appartement,87,4,,,,,,2.265018,48.897581
2020-1312879,2020-01-27,000001,Vente,625000,7,,RUE JEAN BAPTISTE CHARCOT,4720,92400,92026,Courbevoie,92,,,92026000BD0199,,,176,,,,,,,,,,1,3,Dépendance,,0,,,,,,2.265018,48.897581
2020-1312884,2020-01-23,000001,Vente,360050,73,,RUE DE BEZONS,0645,92400,92026,Courbevoie,92,,,920260000U0280,,,10,48.8,,,,,,,,,1,2,Appartement,46,2,,,,,,2.247778,48.897016
2020-1312885,2020-01-17,000001,Vente,576350,1,,PARC DE LATTRE DE TASSIGNY,2525,92400,92026,Courbevoie,92,,,92026000AN0122,,,1254,,425,,,,,,,,2,2,Appartement,80,4,,,,,,2.260324,48.895022
2020-1312885,2020-01-17,000001,Vente,576350,5,,PARC DE LATTRE DE TASSIGNY,2525,92400,92026,Courbevoie,92,,,92026000AN0122,,,228,,,,,,,,,,1,3,Dépendance,,0,,,,,,2.260324,48.895022
2020-1312888,2020-01-21,000001,Vente,175000,107,,QUAI MARECHAL JOFFRE,6125,92400,92026,Courbevoie,92,,,92026000BJ0085,,,25,,61,25.64,,,,,,,2,2,Appartement,25,1,,,,,,2.282791,48.902919
2020-1312892,2020-01-15,000001,Vente,215000,30,,RUE DE BELFORT,0635,92400,92026,Courbevoie,92,,,920260000Y0378,,,1077,30.06,1179,,,,,,,,2,2,Appartement,31,1,,,,,,2.246419,48.894914
2020-1312893,2020-01-21,000001,Vente,416000,13,,PL CHARRAS,1520,92400,92026,Courbevoie,92,,,920260000Z0401,,,236,,,,,,,,,,1,3,Dépendance,,0,,,,,,2.250128,48.893787
2020-1312893,2020-01-21,000001,Vente,416000,13,,PL CHARRAS,1520,92400,92026,Courbevoie,92,,,920260000Z0401,,,276,,28,62.88,,,,,,,2,2,Appartement,63,3,,,,,,2.250128,48.893787
2020-1312905,2020-01-22,000001,Vente,323000,6,,ALL DES TILLEULS,9046,92400,92026,Courbevoie,92,,,920260000D0538,,,103034,,,,,,,,,,1,3,Dépendance,,0,,,,,,2.237501,48.898508
2020-1312907,2020-01-28,000001,Vente en l'état futur d'achèvement,319080,35,,RUE DES MINIMES,6170,92400,92026,Courbevoie,92,,,92026000AP0033,,,3083,,,,,,,,,,1,3,Dépendance,,0,,,,,,2.261859,48.905213
2020-1312907,2020-01-28,000001,Vente en l'état futur d'achèvement,319080,35,,RUE DES MINIMES,6170,92400,92026,Courbevoie,92,,,92026000AP0033,,,1040,,,,,,,,,,1,2,Appartement,41,2,,,,,,2.261859,48.905213
2020-1312908,2020-01-24,000001,Vente en l'état futur d'achèvement,299000,35,,RUE DES MINIMES,6170,92400,92026,Courbevoie,92,,,92026000AP0033,,,10001,,,,,,,,,,1,2,Appartement,61,3,,,,,,2.261859,48.905213
2020-1312910,2020-01-03,000001,Vente en l'état futur d'achèvement,315000,3,,RUE ARMAND SILVESTRE,0078,92400,92026,Courbevoie,92,,,92026000AR0012,,,2,,,,,,,,,,1,2,Appartement,44,2,,,,,,2.261751,48.900103
2020-1312917,2020-01-16,000001,Vente,376812,36,,BD DE VERDUN,9630,92400,92026,Courbevoie,92,,,92026000BC0001,,,8,56.45,,,,,,,,,1,2,Appartement,55,3,,,,,,2.262232,48.899452
2020-1312921,2020-01-23,000001,Vente,360000,22,,AV GALLIENI,4105,92400,92026,Courbevoie,92,,,92026000AT0053,,,95,43.69,,,,,,,,,1,4,Local industriel. commercial ou assimilé,38,0,,,,,,2.270794,48.904835
2020-1312921,2020-01-23,000001,Vente,360000,22,,AV GALLIENI,4105,92400,92026,Courbevoie,92,,,92026000AT0053,,,95,43.69,,,,,,,,,1,2,Appartement,30,1,,,,,,2.270794,48.904835
2020-1312922,2020-01-27,000001,Vente,619300,84,,RUE DU 22 SEPTEMBRE,9665,92400,92026,Courbevoie,92,,,92026000AV0018,,,32,,9,73.28,,,,,,,2,2,Appartement,75,4,,,,,,2.273862,48.905507
2020-1312929,2020-01-17,000001,Vente,775000,14,,RUE DES LILAS D ESPAGNE,5163,92400,92026,Courbevoie,92,,,920260000D0572,,,2020,112.82,2104,,,,,,,,2,2,Appartement,113,4,,,,,,2.236475,48.898093
2020-1312929,2020-01-17,000001,Vente,775000,10,T,RUE DES LILAS D ESPAGNE,5163,92400,92026,Courbevoie,92,,,920260000D0572,,,4037,,,,,,,,,,1,3,Dépendance,,0,,,,,,2.236475,48.898093
2020-1312929,2020-01-17,000001,Vente,775000,10,T,RUE DES LILAS D ESPAGNE,5163,92400,92026,Courbevoie,92,,,920260000D0572,,,4036,,,,,,,,,,1,3,Dépendance,,0,,,,,,2.236475,48.898093
2020-1312931,2020-01-17,000001,Vente,394050,91,,AV MARCEAU,6120,92400,92026,Courbevoie,92,,,920260000I0123,,,2,,23,61.89,,,,,,,2,2,Appartement,62,3,,,,,,2.242813,48.902231
2020-1312940,2020-01-28,000001,Vente,636000,26,,RUE JEAN BART,4730,92400,92026,Courbevoie,92,,,920260000L0087,,,,,,,,,,,,,0,1,Maison,45,2,S,sols,,,171,2.251744,48.900659
2020-1312943,2020-01-22,000001,Vente,16300,16,,RUE FRANKLIN,3576,92400,92026,Courbevoie,92,,,92026000AZ0148,,,437,,,,,,,,,,1,3,Dépendance,,0,,,,,,2.269424,48.900863
2020-1312945,2020-01-24,000001,Vente,239400,56,,AV PUVIS DE CHAVANNES,7184,92400,92026,Courbevoie,92,,,920260000C0367,,,122,,,,,,,,,,1,3,Dépendance,,0,,,,,,2.23729,48.898988
2020-1312945,2020-01-24,000001,Vente,239400,8,,ALL DES TILLEULS,9046,92400,92026,Courbevoie,92,,,920260000C0367,,,233,26.26,,,,,,,,,1,2,Appartement,47,2,,,,,,2.23729,48.898988
2020-1312949,2020-01-24,000001,Vente,502720,36,,RUE JULES FERRY,4785,92400,92026,Courbevoie,92,,,92026000BC0295,,,21,65.27,82,,,,,,,,2,2,Appartement,65,3,,,,,,2.265205,48.899601
2020-1312949,2020-01-24,000001,Vente,502720,38,,RUE JULES FERRY,4785,92400,92026,Courbevoie,92,,,92026000BC0295,,,126,,,,,,,,,,1,3,Dépendance,,0,,,,,,2.265205,48.899601
2020-1312949,2020-01-24,000001,Vente,502720,38,,RUE JULES FERRY,4785,92400,92026,Courbevoie,92,,,92026000BC0295,,,125,,,,,,,,,,1,3,Dépendance,,0,,,,,,2.265205,48.899601
2020-1312956,2020-01-27,000001,Vente,416000,56,,RUE D ESTIENNE D ORVES,3165,92400,92026,Courbevoie,92,,,920260000M0115,,,2,64.12,5,,7,,,,,,3,2,Appartement,64,3,,,,,,2.250655,48.902771
2020-1312962,2020-01-23,000001,Vente en l'état futur d'achèvement,635000,7,,RUE BARBES,0615,92400,92026,Courbevoie,92,,,920260000K0019,,,95,,,,,,,,,,1,3,Dépendance,,0,,,,,,2.248064,48.899436
2020-1312962,2020-01-23,000001,Vente en l'état futur d'achèvement,635000,7,,RUE BARBES,0615,92400,92026,Courbevoie,92,,,920260000K0019,,,35,,,,,,,,,,1,2,Appartement,64,3,,,,,,2.248064,48.899436
2020-1312964,2020-01-16,000001,Vente,350000,43,,RUE DU 22 SEPTEMBRE,9665,92400,92026,Courbevoie,92,,,92026000AT0053,,,3,50.07,,,,,,,,,1,2,Appartement,51,3,,,,,,2.270794,48.904835
2020-1312965,2020-01-23,000001,Vente en l'état futur d'achèvement,394000,7,,RUE BARBES,0615,92400,92026,Courbevoie,92,,,920260000K0019,,,34,,,,,,,,,,1,2,Appartement,41,2,,,,,,2.248064,48.899436
2020-1312965,2020-01-23,000001,Vente en l'état futur d'achèvement,394000,7,,RUE BARBES,0615,92400,92026,Courbevoie,92,,,920260000K0019,,,73,,,,,,,,,,1,3,Dépendance,,0,,,,,,2.248064,48.899436
2020-1312967,2020-01-30,000001,Vente,461500,6,,AV DE CHATEAU DU LOIR,1530,92400,92026,Courbevoie,92,,,920260000S0018,,,153,90.02,154,,,,,,,,2,2,Appartement,86,3,,,,,,2.250674,48.898787
2020-1312968,2020-01-23,000001,Vente en l'état futur d'achèvement,626000,7,,RUE BARBES,0615,92400,92026,Courbevoie,92,,,920260000K0019,,,96,,,,,,,,,,1,3,Dépendance,,0,,,,,,2.248064,48.899436
2020-1312968,2020-01-23,000001,Vente en l'état futur d'achèvement,626000,7,,RUE BARBES,0615,92400,92026,Courbevoie,92,,,920260000K0019,,,28,,,,,,,,,,1,2,Appartement,64,3,,,,,,2.248064,48.899436
2020-1312979,2020-01-29,000001,Vente,462000,5,,PROM DES PINS,7152,92400,92026,Courbevoie,92,,,920260000C0324,,,120,66.85,197,,,,,,,,2,2,Appartement,66,3,,,,,,2.23753,48.899127
2020-1312979,2020-01-29,000001,Vente,462000,62,,AV PUVIS DE CHAVANNES,7184,92400,92026,Courbevoie,92,,,920260000C0324,,,183,,,,,,,,,,1,3,Dépendance,,0,,,,,,2.23753,48.899127
2020-1312982,2020-01-16,000001,Vente,25000,21,,RUE SAINTE GENEVIEVE,8875,92400,92026,Courbevoie,92,,,92026000BI0075,,,120,,,,,,,,,,1,3,Dépendance,,0,,,,,,2.278936,48.902849
2020-1312983,2020-01-17,000001,Vente en l'état futur d'achèvement,890000,28,,RUE EDITH CAVELL,3120,92400,92026,Courbevoie,92,,,92026000AY0055,,,24,,,,,,,,,,1,,,,,,,,,,2.26913,48.902354
2020-1312983,2020-01-17,000001,Vente en l'état futur d'achèvement,890000,28,,RUE EDITH CAVELL,3120,92400,92026,Courbevoie,92,,,92026000AY0055,,,57,,,,,,,,,,1,,,,,,,,,,2.26913,48.902354
2020-1312983,2020-01-17,000001,Vente en l'état futur d'achèvement,890000,28,,RUE EDITH CAVELL,3120,92400,92026,Courbevoie,92,,,92026000AY0055,,,73,,,,,,,,,,1,,,,,,,,,,2.26913,48.902354
2020-1312989,2020-01-31,000001,Vente,435120,39,,RUE RASPAIL,8120,92400,92026,Courbevoie,92,,,920260000M0228,,,319,,,,,,,,,,1,3,Dépendance,,0,,,,,,2.251571,48.902801
2020-1312989,2020-01-31,000001,Vente,435120,37,B,RUE PIERRE BROSSOLETTE,7145,92400,92026,Courbevoie,92,,,920260000M0228,,,255,,,,,,,,,,1,3,Dépendance,,0,,,,,,2.251571,48.902801
2020-1312989,2020-01-31,000001,Vente,435120,35,,RUE PIERRE BROSSOLETTE,7145,92400,92026,Courbevoie,92,,,920260000M0228,,,13,,177,,7,93.77,,,,,3,2,Appartement,93,5,,,,,,2.251571,48.902801
2020-1312990,2020-01-10,000001,Vente,473000,139,,BD SAINT DENIS,8620,92400,92026,Courbevoie,92,,,92026000BC0252,,,1019,,503,78.21,,,,,,,2,2,Appartement,80,3,,,,,,2.265373,48.899322
2020-1312990,2020-01-10,000001,Vente,473000,145,,BD SAINT DENIS,8620,92400,92026,Courbevoie,92,,,92026000BC0252,,,1425,,,,,,,,,,1,3,Dépendance,,0,,,,,,2.265373,48.899322
2020-1312995,2020-01-24,000001,Vente en l'état futur d'achèvement,514900,,,,,,92026,Courbevoie,92,,,920260000F0021,,,30,,,,,,,,,,1,,,,,,,,,,2.241754,48.897155
2020-1312995,2020-01-24,000001,Vente en l'état futur d'achèvement,514900,,,,,,92026,Courbevoie,92,,,920260000F0021,,,11,,,,,,,,,,1,,,,,,,,,,2.241754,48.897155
2020-1312997,2020-01-13,000001,Vente,301110,26,,RUE MADIRAA,6105,92400,92026,Courbevoie,92,,,92026000AU0059,,,115,,80,44.78,,,,,,,2,2,Appartement,43,2,,,,,,2.273803,48.907024