id_mutation,date_mutation,numero_disposition,nature_mutation,valeur_fonciere,adresse_numero,adresse_suffixe,adresse_nom_voie,adresse_code_voie,code_postal,code_commune,nom_commune,code_departement,ancien_code_commune,ancien_nom_commune,id_parcelle,ancien_id_parcelle,numero_volume,lot1_numero,lot1_surface_carrez,lot2_numero,lot2_surface_carrez,lot3_numero,lot3_surface_carrez,lot4_numero,lot4_surface_carrez,lot5_numero,lot5_surface_carrez,nombre_lots,code_type_local,type_local,surface_reelle_bati,nombre_pieces_principales,code_nature_culture,nature_culture,code_nature_culture_speciale,nature_culture_speciale,surface_terrain,longitude,latitude
2020-1410815,2020-01-22,000001,Vente,255000,5688,,CHE DE BELLE HOTESSE,0060,97116,97121,Pointe-Noire,971,,,97121000AK0410,,,,,,,,,,,,,0,1,Maison,100,4,S,sols,,,478,-61.785733,16.253094
2020-1410815,2020-01-22,000001,Vente,255000,5688,,CHE DE BELLE HOTESSE,0060,97116,97121,Pointe-Noire,971,,,97121000AK0410,,,,,,,,,,,,,0,1,Maison,100,4,T,terres,,,1372,-61.785733,16.253094
2020-1410866,2020-02-03,000001,Vente,12420,,,RUE NENUPHARS,0129,97116,97121,Pointe-Noire,971,,,97121000AP0351,,,,,,,,,,,,,0,,,,,S,sols,,,310,-61.784836,16.227159
2020-1410866,2020-02-03,000001,Vente,12420,,,RUE RUE DES BALISIERS,0023,97116,97121,Pointe-Noire,971,,,97121000AP0426,,,,,,,,,,,,,0,,,,,S,sols,,,104,-61.78493,16.227221
2020-1410957,2020-04-01,000001,Vente,297000,,,BELLEVUE,B016,97116,97121,Pointe-Noire,971,,,97121000AR0489,,,,,,,,,,,,,0,,,,,B,bois,,,1375,-61.786183,16.231373
2020-1411005,2020-05-07,000001,Vente,50560,,,BELLEVUE,B016,97116,97121,Pointe-Noire,971,,,97121000AR0657,,,,,,,,,,,,,0,,,,,B,bois,,,6320,-61.779435,16.236049
2020-1411026,2020-05-19,000001,Vente,30000,,,MORPHY NORD,B082,97116,97121,Pointe-Noire,971,,,97121000AH0276,,,,,,,,,,,,,0,,,,,B,bois,,,1050,-61.799027,16.248807
2020-1411026,2020-05-19,000001,Vente,30000,,,MORPHY NORD,B082,97116,97121,Pointe-Noire,971,,,97121000AH0289,,,,,,,,,,,,,0,,,,,B,bois,,,2437,-61.799085,16.248555
2020-1411249,2020-08-28,000001,Vente,355000,,,CHE DE GROS MORNE,0084,97116,97121,Pointe-Noire,971,,,97121000AY0291,,,,,,,,,,,,,0,,,,,S,sols,,,905,-61.771375,16.217257
2020-1411249,2020-08-28,000001,Vente,355000,5010,,CHE DE THOMY,0135,97116,97121,Pointe-Noire,971,,,97121000AY0293,,,,,,,,,,,,,0,1,Maison,82,4,AB,terrains a bâtir,,,95,-61.771515,16.217401
2020-1411286,2020-09-18,000001,Vente,35000,,,CHE DE L ILET,0105,97116,97121,Pointe-Noire,971,,,97121000AM0455,,,,,,,,,,,,,0,,,,,S,sols,,,441,-61.784336,16.233014
2020-1411387,2020-10-28,000001,Vente,855290.4,140,,CHE DE BELLEVUE,0065,97116,97121,Pointe-Noire,971,,,97121000AR0487,,,,,,,,,,,,,0,2,Appartement,25,1,S,sols,,,53900,-61.776776,16.232648
2020-1411387,2020-10-28,000001,Vente,855290.4,140,,CHE DE BELLEVUE,0065,97116,97121,Pointe-Noire,971,,,97121000AR0487,,,,,,,,,,,,,0,3,Dépendance,,0,S,sols,,,1000,-61.776776,16.232648
2020-1411387,2020-10-28,000001,Vente,855290.4,140,,CHE DE BELLEVUE,0065,97116,97121,Pointe-Noire,971,,,97121000AR0487,,,,,,,,,,,,,0,3,Dépendance,,0,S,sols,,,53900,-61.776776,16.232648
2020-1411387,2020-10-28,000001,Vente,855290.4,140,,CHE DE BELLEVUE,0065,97116,97121,Pointe-Noire,971,,,97121000AR0487,,,,,,,,,,,,,0,4,Local industriel. commercial ou assimilé,120,0,S,sols,,,1000,-61.776776,16.232648
2020-1411387,2020-10-28,000001,Vente,855290.4,140,,CHE DE BELLEVUE,0065,97116,97121,Pointe-Noire,971,,,97121000AR0487,,,,,,,,,,,,,0,2,Appartement,25,1,S,sols,,,1000,-61.776776,16.232648
2020-1411387,2020-10-28,000001,Vente,855290.4,140,,CHE DE BELLEVUE,0065,97116,97121,Pointe-Noire,971,,,97121000AR0487,,,,,,,,,,,,,0,4,Local industriel. commercial ou assimilé,120,0,S,sols,,,53900,-61.776776,16.232648
2020-1411401,2020-10-27,000001,Vente,120000,7407,,ALL DES ORANGERS,0132,97116,97121,Pointe-Noire,971,,,97121000BH0377,,,,,,,,,,,,,0,1,Maison,152,4,S,sols,,,977,-61.77727,16.207727
2020-1411419,2020-10-20,000001,Vente,310400,1,,GRANDE PLAINE SUD,B134,97116,97121,Pointe-Noire,971,,,97121000BH0394,,,,,,,,,,,,,0,1,Maison,127,3,AB,terrains a bâtir,,,972,-61.778531,16.20725
2020-1411511,2020-11-25,000001,Vente,380000,,,CHE DE GROS MORNE,0084,97116,97121,Pointe-Noire,971,,,97121000AY0241,,,,,,,,,,,,,0,,,,,AB,terrains a bâtir,,,1365,-61.770059,16.21656
2020-1411539,2020-11-23,000001,Vente,135000,120,A,RTE DES PLAINES,0136,97116,97121,Pointe-Noire,971,,,97121000AS0120,,,,,,,,,,,,,0,1,Maison,106,3,S,sols,,,587,-61.759871,16.226877
2020-1411558,2020-12-14,000002,Vente,143050,7007,,CHE DE VARIN,0145,97116,97121,Pointe-Noire,971,,,97121000AM0492,,,,,,,,,,,,,0,,,,,B,bois,,,3161,,
2020-1411699,2020-12-09,000001,Vente,15000,5803,,RUE ARMAND FELIX,0003,97116,97121,Pointe-Noire,971,,,97121000AN0304,,,,,,,,,,,,,0,1,Maison,120,4,S,sols,,,500,-61.793751,16.236379
