id_mutation,date_mutation,numero_disposition,nature_mutation,valeur_fonciere,adresse_numero,adresse_suffixe,adresse_nom_voie,adresse_code_voie,code_postal,code_commune,nom_commune,code_departement,ancien_code_commune,ancien_nom_commune,id_parcelle,ancien_id_parcelle,numero_volume,lot1_numero,lot1_surface_carrez,lot2_numero,lot2_surface_carrez,lot3_numero,lot3_surface_carrez,lot4_numero,lot4_surface_carrez,lot5_numero,lot5_surface_carrez,nombre_lots,code_type_local,type_local,surface_reelle_bati,nombre_pieces_principales,code_nature_culture,nature_culture,code_nature_culture_speciale,nature_culture_speciale,surface_terrain,longitude,latitude
2021-646426,2021-02-25,000001,Vente,5218,,,LES CHOLTIERES,B052,37240,37136,Le Louroux,37,,,37136000BR0026,,,,,,,,,,,,,0,,,,,T,terres,,,7730,0.779999,47.164358
2021-646426,2021-02-25,000001,Vente,5218,,,LA CROIX ROUGE,B062,37240,37136,Le Louroux,37,,,371360000G0027,,,,,,,,,,,,,0,,,,,T,terres,,,5315,0.790669,47.163811
2021-646470,2021-03-16,000001,Vente,270000,127,A,LES MASNIERS,B121,37240,37136,Le Louroux,37,,,37136000FR0118,,,,,,,,,,,,,0,1,Maison,150,5,BR,futaies résineuses,,,9977,0.76685,47.141353
2021-646470,2021-03-16,000001,Vente,270000,127,A,LES MASNIERS,B121,37240,37136,Le Louroux,37,,,37136000FR0118,,,,,,,,,,,,,0,1,Maison,150,5,AG,terrains d'agrément,,,2629,0.76685,47.141353
2021-646470,2021-03-16,000001,Vente,270000,127,A,LES MASNIERS,B121,37240,37136,Le Louroux,37,,,37136000FR0118,,,,,,,,,,,,,0,1,Maison,150,5,BP,peupleraies,,,6375,0.76685,47.141353
2021-646470,2021-03-16,000001,Vente,270000,127,A,LES MASNIERS,B121,37240,37136,Le Louroux,37,,,37136000FR0118,,,,,,,,,,,,,0,1,Maison,150,5,S,sols,,,994,0.76685,47.141353
2021-646608,2021-04-20,000001,Vente,60000,,,LA TURMELLIERE,B186,37240,37136,Le Louroux,37,,,371360000D0505,,,,,,,,,,,,,0,,,,,BT,taillis simples,,,1900,0.71409,47.142418
2021-646608,2021-04-20,000001,Vente,60000,,,LA TURMELLIERE,B186,37240,37136,Le Louroux,37,,,371360000D0506,,,,,,,,,,,,,0,,,,,BT,taillis simples,,,2905,0.713356,47.142341
2021-646608,2021-04-20,000001,Vente,60000,,,LA TURMELLIERE,B186,37240,37136,Le Louroux,37,,,371360000D0507,,,,,,,,,,,,,0,,,,,E,eaux,MARE,Mare,223,0.713383,47.142194
2021-646608,2021-04-20,000001,Vente,60000,,,LA TURMELLIERE,B186,37240,37136,Le Louroux,37,,,371360000D0507,,,,,,,,,,,,,0,,,,,P,prés,,,1317,0.713383,47.142194
2021-646608,2021-04-20,000001,Vente,60000,,,LA TURMELLIERE,B186,37240,37136,Le Louroux,37,,,371360000D0967,,,,,,,,,,,,,0,,,,,S,sols,,,1324,0.713181,47.141315
2021-646608,2021-04-20,000001,Vente,60000,,,LA TURMELLIERE,B186,37240,37136,Le Louroux,37,,,371360000D0969,,,,,,,,,,,,,0,,,,,S,sols,,,51,0.712707,47.141024
2021-646608,2021-04-20,000001,Vente,60000,,,LA TURMELLIERE,B186,37240,37136,Le Louroux,37,,,371360000D0970,,,,,,,,,,,,,0,,,,,T,terres,,,10990,0.712712,47.141403
2021-646653,2021-04-21,000001,Vente,1700,,,LES METAIRIES,B125,37240,37136,Le Louroux,37,,,371360000A0299,,,,,,,,,,,,,0,,,,,BT,taillis simples,,,4070,0.791443,47.17799
2021-646674,2021-04-22,000001,Vente,170000,116,,LA BASSE COUR,B007,37240,37136,Le Louroux,37,,,371360000C1183,,,,,,,,,,,,,0,1,Maison,128,3,S,sols,,,3103,0.728648,47.161464
2021-646706,2021-05-10,000001,Vente,1200,,,LES ROUGERIES,B174,37240,37136,Le Louroux,37,,,371360000A0419,,,,,,,,,,,,,0,,,,,T,terres,,,3540,0.78498,47.173872
2021-646764,2021-05-10,000002,Vente,1040000,,,TARTOIS,B178,37240,37136,Le Louroux,37,,,37136000AR0677,,,,,,,,,,,,,0,,,,,T,terres,,,15156,0.817341,47.168441
2021-646764,2021-05-10,000002,Vente,1040000,,,TARTOIS,B178,37240,37136,Le Louroux,37,,,37136000AR0677,,,,,,,,,,,,,0,,,,,T,terres,,,15156,0.817341,47.168441
2021-646764,2021-05-10,000002,Vente,1040000,,,LE MOULIN DU PRE,B127,37240,37136,Le Louroux,37,,,37136000AR0708,,,,,,,,,,,,,0,,,,,S,sols,,,35,0.822477,47.171078
2021-646764,2021-05-10,000002,Vente,1040000,,,LE MOULIN DU PRE,B127,37240,37136,Le Louroux,37,,,37136000AR0709,,,,,,,,,,,,,0,,,,,T,terres,,,50,0.822644,47.171137
2021-646764,2021-05-10,000002,Vente,1040000,,,LE MOULIN DUPRE,B128,37240,37136,Le Louroux,37,,,37136000AR0710,,,,,,,,,,,,,0,,,,,T,terres,,,731,0.822508,47.171155
2021-646764,2021-05-10,000002,Vente,1040000,,,LE MOULIN DU PRE,B127,37240,37136,Le Louroux,37,,,37136000AR0711,,,,,,,,,,,,,0,,,,,T,terres,,,11124,0.822078,47.171399
2021-646764,2021-05-10,000002,Vente,1040000,,,LE MOULIN DU PRE,B127,37240,37136,Le Louroux,37,,,37136000AR0711,,,,,,,,,,,,,0,,,,,BT,taillis simples,,,360,0.822078,47.171399
2021-646764,2021-05-10,000002,Vente,1040000,,,LE MOULIN DU PRE,B127,37240,37136,Le Louroux,37,,,37136000AR0714,,,,,,,,,,,,,0,,,,,P,prés,,,5815,0.82178,47.172158
2021-646764,2021-05-10,000002,Vente,1040000,209,,LE MOULIN DU PRE,B127,37240,37136,Le Louroux,37,,,37136000AR0715,,,,,,,,,,,,,0,3,Dépendance,,0,S,sols,,,500,0.822331,47.172294
2021-646764,2021-05-10,000002,Vente,1040000,209,,LE MOULIN DU PRE,B127,37240,37136,Le Louroux,37,,,37136000AR0715,,,,,,,,,,,,,0,3,Dépendance,,0,T,terres,,,3140,0.822331,47.172294
2021-646764,2021-05-10,000002,Vente,1040000,209,,LE MOULIN DU PRE,B127,37240,37136,Le Louroux,37,,,37136000AR0715,,,,,,,,,,,,,0,3,Dépendance,,0,BT,taillis simples,,,3840,0.822331,47.172294
2021-646764,2021-05-10,000002,Vente,1040000,,,TARTOIS,B178,37240,37136,Le Louroux,37,,,37136000AR0725,,,,,,,,,,,,,0,,,,,BP,peupleraies,,,590,0.821997,47.170765
2021-646764,2021-05-10,000002,Vente,1040000,,,TARTOIS,B178,37240,37136,Le Louroux,37,,,37136000AR0726,,,,,,,,,,,,,0,,,,,E,eaux,ETANG,Etangs,6270,0.820974,47.170126
2021-646764,2021-05-10,000002,Vente,1040000,,,TARTOIS,B178,37240,37136,Le Louroux,37,,,37136000AR0727,,,,,,,,,,,,,0,,,,,L,landes,,,8024,0.819812,47.169762
2021-646764,2021-05-10,000002,Vente,1040000,,,TARTOIS,B178,37240,37136,Le Louroux,37,,,37136000AR0728,,,,,,,,,,,,,0,,,,,BP,peupleraies,,,4002,0.819605,47.169328
2021-646764,2021-05-10,000002,Vente,1040000,,,LE MOULIN DU PRE,B127,37240,37136,Le Louroux,37,,,37136000AR0797,,,,,,,,,,,,,0,,,,,J,jardins,POTAG,Jardin potager,1431,0.823626,47.171343
2021-646764,2021-05-10,000002,Vente,1040000,,,LE MOULIN DU PRE,B127,37240,37136,Le Louroux,37,,,37136000AR0797,,,,,,,,,,,,,0,,,,,S,sols,,,809,0.823626,47.171343
2021-646764,2021-05-10,000002,Vente,1040000,,,LE MOULIN DU PRE,B127,37240,37136,Le Louroux,37,,,37136000AR0888,,,,,,,,,,,,,0,,,,,S,sols,,,528,0.822956,47.170939
2021-646874,2021-05-20,000001,Vente,187500,238,,LA BREPENNIERE,B024,37240,37136,Le Louroux,37,,,37136000ZH0014,,,,,,,,,,,,,0,1,Maison,131,6,S,sols,,,1146,0.749465,47.137081
2021-646874,2021-05-20,000001,Vente,187500,238,,LA BREPENNIERE,B024,37240,37136,Le Louroux,37,,,37136000ZH0014,,,,,,,,,,,,,0,3,Dépendance,,0,S,sols,,,1146,0.749465,47.137081
2021-646874,2021-05-20,000001,Vente,187500,238,,LA BREPENNIERE,B024,37240,37136,Le Louroux,37,,,37136000ZH0014,,,,,,,,,,,,,0,3,Dépendance,,0,S,sols,,,1146,0.749465,47.137081
2021-646974,2021-06-21,000001,Vente,96000,101,,LA TURMELLIERE,B186,37240,37136,Le Louroux,37,,,371360000D0968,,,,,,,,,,,,,0,1,Maison,36,2,AG,terrains d'agrément,,,1130,0.712782,47.141201
2021-646974,2021-06-21,000001,Vente,96000,101,,LA TURMELLIERE,B186,37240,37136,Le Louroux,37,,,371360000D0968,,,,,,,,,,,,,0,1,Maison,181,6,AG,terrains d'agrément,,,1130,0.712782,47.141201
2021-646974,2021-06-21,000001,Vente,96000,101,,LA TURMELLIERE,B186,37240,37136,Le Louroux,37,,,371360000D0968,,,,,,,,,,,,,0,1,Maison,36,2,S,sols,,,500,0.712782,47.141201
2021-646974,2021-06-21,000001,Vente,96000,101,,LA TURMELLIERE,B186,37240,37136,Le Louroux,37,,,371360000D0968,,,,,,,,,,,,,0,1,Maison,181,6,S,sols,,,500,0.712782,47.141201
2021-646974,2021-06-21,000001,Vente,96000,,,LA TURMELLIERE,B186,37240,37136,Le Louroux,37,,,371360000D0971,,,,,,,,,,,,,0,,,,,S,sols,,,6,0.712556,47.141172
2021-647124,2021-07-19,000001,Vente,75250,,,LES DEFAIX,B064,37240,37136,Le Louroux,37,,,37136000ZB0008,,,,,,,,,,,,,0,,,,,T,terres,,,31152,0.737951,47.156461
2021-647124,2021-07-19,000001,Vente,75250,,,LES DEFAIX,B064,37240,37136,Le Louroux,37,,,37136000ZB0008,,,,,,,,,,,,,0,,,,,P,prés,,,1287,0.737951,47.156461
2021-647124,2021-07-19,000001,Vente,75250,,,LES DEFAIX,B064,37240,37136,Le Louroux,37,,,37136000ZB0008,,,,,,,,,,,,,0,,,,,E,eaux,ETANG,Etangs,945,0.737951,47.156461
2021-647124,2021-07-19,000001,Vente,75250,,,LES DEFAIX,B064,37240,37136,Le Louroux,37,,,37136000ZB0008,,,,,,,,,,,,,0,,,,,BT,taillis simples,,,1387,0.737951,47.156461
2021-647124,2021-07-19,000001,Vente,75250,,,LES DEFAIX,B064,37240,37136,Le Louroux,37,,,37136000ZB0008,,,,,,,,,,,,,0,,,,,E,eaux,ETANG,Etangs,563,0.737951,47.156461
2021-647124,2021-07-19,000001,Vente,75250,,,LES DEFAIX,B064,37240,37136,Le Louroux,37,,,37136000ZB0008,,,,,,,,,,,,,0,,,,,BT,taillis simples,,,5308,0.737951,47.156461
2021-647124,2021-07-19,000001,Vente,75250,,,LES DEFAIX,B064,37240,37136,Le Louroux,37,,,37136000ZB0008,,,,,,,,,,,,,0,,,,,P,prés,,,16388,0.737951,47.156461
2021-647124,2021-07-19,000001,Vente,75250,,,LES DEFAIX,B064,37240,37136,Le Louroux,37,,,37136000ZB0008,,,,,,,,,,,,,0,,,,,T,terres,,,93455,0.737951,47.156461
2021-647239,2021-07-26,000001,Vente,199000,,,LA BREPENNIERE,B024,37240,37136,Le Louroux,37,,,37136000FR0207,,,,,,,,,,,,,0,1,Maison,114,4,S,sols,,,1148,0.751257,47.137045
2021-647239,2021-07-26,000001,Vente,199000,,,LA BREPENNIERE,B024,37240,37136,Le Louroux,37,,,37136000FR0207,,,,,,,,,,,,,0,3,Dépendance,,0,S,sols,,,1148,0.751257,47.137045
2021-647248,2021-07-29,000001,Vente,112500,28,,LE BOIS HARDEAU,B018,37240,37136,Le Louroux,37,,,37136000AR0828,,,,,,,,,,,,,0,3,Dépendance,,0,S,sols,,,1123,0.79066,47.169424
2021-647248,2021-07-29,000001,Vente,112500,28,,LE BOIS HARDEAU,B018,37240,37136,Le Louroux,37,,,37136000AR0828,,,,,,,,,,,,,0,1,Maison,141,3,S,sols,,,1123,0.79066,47.169424
2021-647248,2021-07-29,000001,Vente,112500,,,LE BOIS HARDEAU,B018,37240,37136,Le Louroux,37,,,37136000AR0829,,,,,,,,,,,,,0,,,,,AB,terrains a bâtir,,,229,0.790949,47.169236
2021-647250,2021-07-21,000001,Vente,185000,5,,LA GOURONNERIE,B094,37240,37136,Le Louroux,37,,,37136000AR0842,,,,,,,,,,,,,0,1,Maison,87,5,AB,terrains a bâtir,,,200,0.800728,47.175919
2021-647250,2021-07-21,000001,Vente,185000,,,LA GOURONNERIE,B094,37240,37136,Le Louroux,37,,,37136000AR0843,,,,,,,,,,,,,0,,,,,AB,terrains a bâtir,,,3,0.800768,47.176066
2021-647250,2021-07-21,000001,Vente,185000,,,LA GOURONNERIE,B094,37240,37136,Le Louroux,37,,,37136000AR0845,,,,,,,,,,,,,0,,,,,AB,terrains a bâtir,,,770,0.801031,47.176239
2021-647250,2021-07-21,000001,Vente,185000,,,LA GOURONNERIE,B094,37240,37136,Le Louroux,37,,,37136000AR0846,,,,,,,,,,,,,0,,,,,AB,terrains a bâtir,,,637,0.800942,47.175912
2021-647281,2021-08-03,000001,Vente,36000,21,,RUE DU MOULIN,0062,37240,37136,Le Louroux,37,,,371360000G0277,,,,,,,,,,,,,0,3,Dépendance,,0,S,sols,,,233,0.785931,47.161307
2021-647281,2021-08-03,000001,Vente,36000,21,,RUE DU MOULIN,0062,37240,37136,Le Louroux,37,,,371360000G0277,,,,,,,,,,,,,0,1,Maison,44,1,S,sols,,,233,0.785931,47.161307
2021-647281,2021-08-03,000001,Vente,36000,21,,RUE DU MOULIN,0062,37240,37136,Le Louroux,37,,,371360000G0277,,,,,,,,,,,,,0,3,Dépendance,,0,S,sols,,,233,0.785931,47.161307
2021-647281,2021-08-03,000001,Vente,36000,21,,RUE DU MOULIN,0062,37240,37136,Le Louroux,37,,,371360000G0277,,,,,,,,,,,,,0,3,Dépendance,,0,S,sols,,,233,0.785931,47.161307
2021-647315,2021-08-10,000001,Vente,235000,4,,LE BOIS HARDEAU,B018,37240,37136,Le Louroux,37,,,37136000AR0830,,,,,,,,,,,,,0,3,Dépendance,,0,AB,terrains a bâtir,,,1124,0.790879,47.169573
2021-647315,2021-08-10,000001,Vente,235000,4,,LE BOIS HARDEAU,B018,37240,37136,Le Louroux,37,,,37136000AR0830,,,,,,,,,,,,,0,1,Maison,132,5,AB,terrains a bâtir,,,1124,0.790879,47.169573
2021-647315,2021-08-10,000001,Vente,235000,,,LE BOIS HARDEAU,B018,37240,37136,Le Louroux,37,,,37136000AR0831,,,,,,,,,,,,,0,,,,,AB,terrains a bâtir,,,229,0.791166,47.169379
2021-647445,2021-09-15,000001,Vente,32000,,,LA BASSE COUR,B007,37240,37136,Le Louroux,37,,,371360000C0618,,,,,,,,,,,,,0,,,,,BT,taillis simples,,,655,0.727246,47.15737
2021-647445,2021-09-15,000001,Vente,32000,,,BOIS DE SAINT MARTIN,B016,37240,37136,Le Louroux,37,,,371360000C0728,,,,,,,,,,,,,0,,,,,BR,futaies résineuses,,,2520,0.720423,47.164593
2021-647445,2021-09-15,000001,Vente,32000,,,BOIS DE SAINT MARTIN,B016,37240,37136,Le Louroux,37,,,371360000C0745,,,,,,,,,,,,,0,,,,,BT,taillis simples,,,1720,0.719927,47.163453
2021-647445,2021-09-15,000001,Vente,32000,,,BOIS DE SAINT MARTIN,B016,37240,37136,Le Louroux,37,,,371360000C0773,,,,,,,,,,,,,0,,,,,BT,taillis simples,,,720,0.718698,47.159448
2021-647445,2021-09-15,000001,Vente,32000,,,LES FEVRIERS,B076,37240,37136,Le Louroux,37,,,371360000C1054,,,,,,,,,,,,,0,,,,,T,terres,,,2430,0.731813,47.163781
2021-647445,2021-09-15,000001,Vente,32000,,,LES FEVRIERS,B076,37240,37136,Le Louroux,37,,,371360000C1055,,,,,,,,,,,,,0,,,,,T,terres,,,9850,0.731587,47.16318
2021-647445,2021-09-15,000001,Vente,32000,,,LES FEVRIERS,B076,37240,37136,Le Louroux,37,,,371360000Z0007,,,,,,,,,,,,,0,,,,,T,terres,,,7900,0.729426,47.163497
2021-647445,2021-09-15,000001,Vente,32000,,,LES FEVRIERS,B076,37240,37136,Le Louroux,37,,,371360000Z0008,,,,,,,,,,,,,0,,,,,T,terres,,,19433,0.729984,47.163054
2021-647540,2021-10-05,000001,Vente,30000,,,LES METAIRIES,B125,37240,37136,Le Louroux,37,,,371360000A0300,,,,,,,,,,,,,0,,,,,T,terres,,,3640,0.792548,47.177264
2021-647540,2021-10-05,000001,Vente,30000,61,,LES METAIRIES,B125,37240,37136,Le Louroux,37,,,371360000A0301,,,,,,,,,,,,,0,1,Maison,36,1,S,sols,,,430,0.792614,47.177123
2021-647671,2021-10-28,000001,Vente,78000,,,LA BASSE COUR,B007,37240,37136,Le Louroux,37,,,371360000C1209,,,,,,,,,,,,,0,,,,,S,sols,,,2,0.729902,47.159305
2021-647671,2021-10-28,000001,Vente,78000,,,LA BASSE COUR,B007,37240,37136,Le Louroux,37,,,371360000C1211,,,,,,,,,,,,,0,,,,,AG,terrains d'agrément,,,219,0.729774,47.15983
2021-647671,2021-10-28,000001,Vente,78000,109,,LA BASSE COUR,B007,37240,37136,Le Louroux,37,,,371360000C1213,,,,,,,,,,,,,0,1,Maison,114,8,S,sols,,,485,0.729862,47.159523
2021-647671,2021-10-28,000001,Vente,78000,,,LA BASSE COUR,B007,37240,37136,Le Louroux,37,,,371360000C1215,,,,,,,,,,,,,0,,,,,AG,terrains d'agrément,,,473,0.730192,47.159377
2021-647671,2021-10-28,000001,Vente,78000,,,LA BASSE COUR,B007,37240,37136,Le Louroux,37,,,371360000C1217,,,,,,,,,,,,,0,,,,,S,sols,,,1065,0.729954,47.1596
2021-647671,2021-10-28,000001,Vente,78000,,,LA BASSE COUR,B007,37240,37136,Le Louroux,37,,,371360000C1218,,,,,,,,,,,,,0,,,,,AG,terrains d'agrément,,,904,0.730279,47.159729
2021-647736,2021-11-23,000001,Vente,1721.4,,,LES ROUGERIES,B174,37240,37136,Le Louroux,37,,,371360000A0397,,,,,,,,,,,,,0,,,,,T,terres,,,3020,0.785228,47.173038
2021-647770,2021-11-19,000001,Vente,240000,,,LES FOURNEAUX,B081,37240,37136,Le Louroux,37,,,37136000AR0682,,,,,,,,,,,,,0,,,,,T,terres,,,366,0.806926,47.176208
2021-647770,2021-11-19,000001,Vente,240000,,,LES FOURNEAUX,B081,37240,37136,Le Louroux,37,,,37136000AR0682,,,,,,,,,,,,,0,,,,,T,terres,,,366,0.806926,47.176208
2021-647770,2021-11-19,000001,Vente,240000,,,LES FOURNEAUX,B081,37240,37136,Le Louroux,37,,,37136000AR0683,,,,,,,,,,,,,0,,,,,J,jardins,POTAG,Jardin potager,695,0.806514,47.176052
2021-647770,2021-11-19,000001,Vente,240000,3,,LES FOURNEAUX,B081,37240,37136,Le Louroux,37,,,37136000AR0684,,,,,,,,,,,,,0,1,Maison,98,3,S,sols,,,2260,0.806428,47.176232
2021-647770,2021-11-19,000001,Vente,240000,,,LES FOURNEAUX,B081,37240,37136,Le Louroux,37,,,37136000AR0686,,,,,,,,,,,,,0,,,,,T,terres,,,230,0.805901,47.1761
2021-647770,2021-11-19,000001,Vente,240000,,,LES FOURNEAUX,B081,37240,37136,Le Louroux,37,,,37136000AR0686,,,,,,,,,,,,,0,,,,,T,terres,,,229,0.805901,47.1761
2021-647799,2021-12-02,000001,Echange,1,,,LES CHAMPS DEVANT,B044,37240,37136,Le Louroux,37,,,371360000D0944,,,,,,,,,,,,,0,,,,,T,terres,,,126,0.713231,47.15301
2021-647799,2021-12-02,000002,Echange,1,,,LES ARMONEAUX,B005,37240,37136,Le Louroux,37,,,371360000C1175,,,,,,,,,,,,,0,,,,,T,terres,,,700,0.711689,47.160181
2021-647929,2021-12-01,000001,Vente,39000,,,BEAUREGARD,B010,37240,37136,Le Louroux,37,,,371360000B0264,,,,,,,,,,,,,0,,,,,AB,terrains a bâtir,,,440,0.787042,47.16352
2021-647929,2021-12-01,000001,Vente,39000,,,BEAUREGARD,B010,37240,37136,Le Louroux,37,,,371360000B0266,,,,,,,,,,,,,0,,,,,AB,terrains a bâtir,,,425,0.786939,47.163456
2021-647929,2021-12-01,000001,Vente,39000,,,BEAUREGARD,B010,37240,37136,Le Louroux,37,,,371360000B0268,,,,,,,,,,,,,0,,,,,S,sols,,,157,0.786978,47.163391
2021-648009,2021-12-28,000001,Vente,125000,4,,LES GIRARDIERES,B089,37240,37136,Le Louroux,37,,,371360000C1181,,,,,,,,,,,,,0,1,Maison,90,3,S,sols,,,553,0.747742,47.157772
2021-648009,2021-12-28,000001,Vente,125000,4,,LES GIRARDIERES,B089,37240,37136,Le Louroux,37,,,371360000C1181,,,,,,,,,,,,,0,1,Maison,90,3,J,jardins,POTAG,Jardin potager,715,0.747742,47.157772
