id_mutation,date_mutation,numero_disposition,nature_mutation,valeur_fonciere,adresse_numero,adresse_suffixe,adresse_nom_voie,adresse_code_voie,code_postal,code_commune,nom_commune,code_departement,ancien_code_commune,ancien_nom_commune,id_parcelle,ancien_id_parcelle,numero_volume,lot1_numero,lot1_surface_carrez,lot2_numero,lot2_surface_carrez,lot3_numero,lot3_surface_carrez,lot4_numero,lot4_surface_carrez,lot5_numero,lot5_surface_carrez,nombre_lots,code_type_local,type_local,surface_reelle_bati,nombre_pieces_principales,code_nature_culture,nature_culture,code_nature_culture_speciale,nature_culture_speciale,surface_terrain,longitude,latitude
2021-806635,2021-01-15,000001,Vente,383570,,,LE BASTIT,B006,46120,46004,Anglars,46,,,460040000A0645,,,,,,,,,,,,,0,,,,,P,prés,,,146,1.886828,44.748303
2021-806635,2021-01-15,000001,Vente,383570,,,LE BASTIT,B006,46120,46004,Anglars,46,,,460040000A0659,,,,,,,,,,,,,0,,,,,P,prés,,,2205,1.88641,44.748068
2021-806635,2021-01-15,000001,Vente,383570,,,LE BASTIT,B006,46120,46004,Anglars,46,,,460040000A0659,,,,,,,,,,,,,0,,,,,S,sols,,,63,1.88641,44.748068
2021-806635,2021-01-15,000001,Vente,383570,2740,,RTE D'AYNAC,0035,46120,46004,Anglars,46,,,460040000A0687,,,,,,,,,,,,,0,1,Maison,62,4,T,terres,,,3657,1.886937,44.748698
2021-806635,2021-01-15,000001,Vente,383570,2740,,RTE D'AYNAC,0035,46120,46004,Anglars,46,,,460040000A0687,,,,,,,,,,,,,0,1,Maison,62,4,T,terres,,,3657,1.886937,44.748698
2021-806635,2021-01-15,000001,Vente,383570,2740,,RTE D'AYNAC,0035,46120,46004,Anglars,46,,,460040000A0687,,,,,,,,,,,,,0,3,Dépendance,,0,T,terres,,,3657,1.886937,44.748698
2021-806635,2021-01-15,000001,Vente,383570,2740,,RTE D'AYNAC,0035,46120,46004,Anglars,46,,,460040000A0687,,,,,,,,,,,,,0,1,Maison,170,5,T,terres,,,3657,1.886937,44.748698
2021-806635,2021-01-15,000001,Vente,383570,2740,,RTE D'AYNAC,0035,46120,46004,Anglars,46,,,460040000A0687,,,,,,,,,,,,,0,1,Maison,170,5,S,sols,,,1000,1.886937,44.748698
2021-806635,2021-01-15,000001,Vente,383570,2740,,RTE D'AYNAC,0035,46120,46004,Anglars,46,,,460040000A0687,,,,,,,,,,,,,0,3,Dépendance,,0,S,sols,,,1000,1.886937,44.748698
2021-806635,2021-01-15,000001,Vente,383570,2740,,RTE D'AYNAC,0035,46120,46004,Anglars,46,,,460040000A0687,,,,,,,,,,,,,0,1,Maison,62,4,S,sols,,,1000,1.886937,44.748698
2021-806635,2021-01-15,000001,Vente,383570,2740,,RTE D'AYNAC,0035,46120,46004,Anglars,46,,,460040000A0687,,,,,,,,,,,,,0,3,Dépendance,,0,T,terres,,,3657,1.886937,44.748698
2021-806635,2021-01-15,000001,Vente,383570,2740,,RTE D'AYNAC,0035,46120,46004,Anglars,46,,,460040000A0687,,,,,,,,,,,,,0,3,Dépendance,,0,S,sols,,,1000,1.886937,44.748698
2021-806635,2021-01-15,000001,Vente,383570,2740,,RTE D'AYNAC,0035,46120,46004,Anglars,46,,,460040000A0687,,,,,,,,,,,,,0,1,Maison,170,5,T,terres,,,3657,1.886937,44.748698
2021-806635,2021-01-15,000001,Vente,383570,2740,,RTE D'AYNAC,0035,46120,46004,Anglars,46,,,460040000A0687,,,,,,,,,,,,,0,3,Dépendance,,0,T,terres,,,3657,1.886937,44.748698
2021-806635,2021-01-15,000001,Vente,383570,2740,,RTE D'AYNAC,0035,46120,46004,Anglars,46,,,460040000A0687,,,,,,,,,,,,,0,3,Dépendance,,0,T,terres,,,3657,1.886937,44.748698
2021-806954,2021-02-08,000001,Vente,127300,112,,RTE DE RUEYRES,0045,46120,46004,Anglars,46,,,460040000C0108,,,,,,,,,,,,,0,1,Maison,110,3,S,sols,,,790,1.904868,44.739679
2021-807459,2021-03-09,000001,Vente,5000,,,CROIX DE LAS BIOS,B063,46120,46004,Anglars,46,,,460040000B0172,,,,,,,,,,,,,0,,,,,BS,taillis sous futaie,,,6555,1.923642,44.750703
2021-808793,2021-06-04,000001,Vente,103000,,,CASSARD,B040,46120,46004,Anglars,46,,,460040000A0757,,,,,,,,,,,,,0,,,,,P,prés,,,7979,1.902075,44.743591
2021-808793,2021-06-04,000001,Vente,103000,411,,RTE DU LAVOIR,0047,46120,46004,Anglars,46,,,460040000D0183,,,,,,,,,,,,,0,1,Maison,100,4,S,sols,,,220,1.902454,44.742782
2021-808793,2021-06-04,000001,Vente,103000,,,LA FACHADOU,B072,46120,46004,Anglars,46,,,460040000D0369,,,,,,,,,,,,,0,,,,,P,prés,,,1209,1.902713,44.742541
2021-808793,2021-06-04,000001,Vente,103000,,,LA COSTE,B058,46120,46004,Anglars,46,,,460040000D0374,,,,,,,,,,,,,0,,,,,BT,taillis simples,,,368,1.900298,44.743797
2021-808793,2021-06-04,000001,Vente,103000,,,LA COSTE,B058,46120,46004,Anglars,46,,,460040000D0376,,,,,,,,,,,,,0,,,,,P,prés,,,171,1.900392,44.74386
2021-808793,2021-06-04,000001,Vente,103000,,,LA FACHADOU,B072,46120,46004,Anglars,46,,,460040000D0378,,,,,,,,,,,,,0,,,,,L,landes,,,1111,1.902617,44.742956
2021-808793,2021-06-04,000001,Vente,103000,,,LA FACHADOU,B072,46120,46004,Anglars,46,,,460040000D0381,,,,,,,,,,,,,0,,,,,P,prés,,,802,1.90192,44.742966
2021-808793,2021-06-04,000001,Vente,103000,,,LA FACHADOU,B072,46120,46004,Anglars,46,,,460040000D0382,,,,,,,,,,,,,0,,,,,P,prés,,,7326,1.902126,44.74202
2021-808793,2021-06-04,000001,Vente,103000,,,LA FACHADOU,B072,46120,46004,Anglars,46,,,460040000D0382,,,,,,,,,,,,,0,,,,,P,prés,,,7327,1.902126,44.74202
2021-808793,2021-06-04,000001,Vente,103000,,,LA FACHADOU,B072,46120,46004,Anglars,46,,,460040000D0386,,,,,,,,,,,,,0,,,,,L,landes,,,122,1.902173,44.743095
2021-809415,2021-07-08,000001,Vente,12000,,,ROUCAUX,B141,46120,46004,Anglars,46,,,460040000A0001,,,,,,,,,,,,,0,,,,,BT,taillis simples,,,3840,1.894096,44.757705
2021-809415,2021-07-08,000001,Vente,12000,,,PECH PIALAT,B136,46120,46004,Anglars,46,,,460040000A0038,,,,,,,,,,,,,0,,,,,BT,taillis simples,,,5175,1.891692,44.762772
2021-809415,2021-07-08,000001,Vente,12000,,,PECH PIALAT,B136,46120,46004,Anglars,46,,,460040000A0039,,,,,,,,,,,,,0,,,,,BT,taillis simples,,,2725,1.891859,44.763199
2021-809415,2021-07-08,000001,Vente,12000,,,LE BOUSQUET,B021,46120,46004,Anglars,46,,,460040000A0301,,,,,,,,,,,,,0,,,,,BS,taillis sous futaie,,,1615,1.89566,44.756068
2021-809415,2021-07-08,000001,Vente,12000,,,LE BOUSQUET,B021,46120,46004,Anglars,46,,,460040000A0301,,,,,,,,,,,,,0,,,,,BT,taillis simples,,,1615,1.89566,44.756068
2021-809415,2021-07-08,000001,Vente,12000,,,LE BOUSQUET,B021,46120,46004,Anglars,46,,,460040000A0303,,,,,,,,,,,,,0,,,,,BT,taillis simples,,,3560,1.897607,44.755729
2021-809415,2021-07-08,000001,Vente,12000,,,AUX FAUX,B073,46120,46004,Anglars,46,,,460040000A0339,,,,,,,,,,,,,0,,,,,BT,taillis simples,,,9400,1.898626,44.753776
2021-809415,2021-07-08,000001,Vente,12000,,,AUX FAUX,B073,46120,46004,Anglars,46,,,460040000A0339,,,,,,,,,,,,,0,,,,,BS,taillis sous futaie,,,9400,1.898626,44.753776
2021-809415,2021-07-08,000001,Vente,12000,,,AUX FAUX,B073,46120,46004,Anglars,46,,,460040000A0351,,,,,,,,,,,,,0,,,,,BS,taillis sous futaie,,,6790,1.898603,44.756023
2021-809415,2021-07-08,000001,Vente,12000,,,MOULI VIEL,B125,46120,46004,Anglars,46,,,460040000A0406,,,,,,,,,,,,,0,,,,,BT,taillis simples,,,19650,1.901419,44.752843
2021-809415,2021-07-08,000001,Vente,12000,,,MOULI VIEL,B125,46120,46004,Anglars,46,,,460040000A0406,,,,,,,,,,,,,0,,,,,BS,taillis sous futaie,,,9825,1.901419,44.752843
2021-810359,2021-08-20,000002,Echange,5000,,,LES COMBES,B056,46120,46004,Anglars,46,,,460040000D0220,,,,,,,,,,,,,0,,,,,PA,pâtures,PATUR,Pâture plantée,3160,1.899791,44.73941
2021-810359,2021-08-20,000002,Echange,5000,,,LES COMBES,B056,46120,46004,Anglars,46,,,460040000D0224,,,,,,,,,,,,,0,,,,,PA,pâtures,PATUR,Pâture plantée,8485,1.901066,44.737937
2021-810359,2021-08-20,000002,Echange,5000,,,LES COMBES,B056,46120,46004,Anglars,46,,,460040000D0228,,,,,,,,,,,,,0,,,,,T,terres,,,2260,1.8984,44.737503
2021-810359,2021-08-20,000002,Echange,5000,,,LES COMBES,B056,46120,46004,Anglars,46,,,460040000D0230,,,,,,,,,,,,,0,,,,,PA,pâtures,PATUR,Pâture plantée,1100,1.897957,44.73794
2021-810359,2021-08-20,000002,Echange,5000,,,LES COMBES,B056,46120,46004,Anglars,46,,,460040000D0231,,,,,,,,,,,,,0,,,,,PA,pâtures,PATUR,Pâture plantée,9250,1.897241,44.738416
2021-810401,2021-08-26,000001,Vente,167000,,,DOUMERGUE,B070,46120,46004,Anglars,46,,,460040000B0326,,,,,,,,,,,,,0,,,,,P,prés,,,1320,1.911414,44.740791
2021-810401,2021-08-26,000001,Vente,167000,302,,RTE D'AYNAC,0035,46120,46004,Anglars,46,,,460040000B0327,,,,,,,,,,,,,0,1,Maison,131,6,S,sols,,,1085,1.910951,44.740607
2021-811218,2021-10-14,000001,Vente,3500,,,DESTANADIS,B065,46120,46004,Anglars,46,,,460040000A0493,,,,,,,,,,,,,0,,,,,S,sols,,,20,1.895441,44.746618
2021-811218,2021-10-14,000001,Vente,3500,,,DESTANADIS,B065,46120,46004,Anglars,46,,,460040000A0494,,,,,,,,,,,,,0,,,,,P,prés,,,9550,1.894865,44.746623
2021-811681,2021-11-08,000001,Vente,1000,,,PECH PIALAT,B136,46120,46004,Anglars,46,,,460040000A0037,,,,,,,,,,,,,0,,,,,BS,taillis sous futaie,,,6097,1.892406,44.762125
2021-811681,2021-11-08,000001,Vente,1000,,,PECH PIALAT,B136,46120,46004,Anglars,46,,,460040000A0037,,,,,,,,,,,,,0,,,,,BT,taillis simples,,,6098,1.892406,44.762125
2021-812677,2021-12-22,000001,Vente,456,,,LAUBANNIE,B101,46120,46004,Anglars,46,,,460040000B0252,,,,,,,,,,,,,0,,,,,BF,futaies feuillues,,,1790,1.919893,44.742995
2021-812677,2021-12-22,000001,Vente,456,,,LAUBANNIE,B101,46120,46004,Anglars,46,,,460040000B0252,,,,,,,,,,,,,0,,,,,BS,taillis sous futaie,,,1790,1.919893,44.742995
