id_mutation,date_mutation,numero_disposition,nature_mutation,valeur_fonciere,adresse_numero,adresse_suffixe,adresse_nom_voie,adresse_code_voie,code_postal,code_commune,nom_commune,code_departement,ancien_code_commune,ancien_nom_commune,id_parcelle,ancien_id_parcelle,numero_volume,lot1_numero,lot1_surface_carrez,lot2_numero,lot2_surface_carrez,lot3_numero,lot3_surface_carrez,lot4_numero,lot4_surface_carrez,lot5_numero,lot5_surface_carrez,nombre_lots,code_type_local,type_local,surface_reelle_bati,nombre_pieces_principales,code_nature_culture,nature_culture,code_nature_culture_speciale,nature_culture_speciale,surface_terrain,longitude,latitude
2021-807404,2021-03-12,000001,Vente,7000,,,LE BATTANT,B001,46150,46136,Labastide-du-Vert,46,,,461360000D0691,,,,,,,,,,,,,0,,,,,P,prés,,,505,1.245046,44.511145
2021-807404,2021-03-12,000001,Vente,7000,,,LE BATTANT,B001,46150,46136,Labastide-du-Vert,46,,,461360000D0692,,,,,,,,,,,,,0,,,,,T,terres,,,2150,1.24524,44.511714
2021-807404,2021-03-12,000001,Vente,7000,,,LE BATTANT,B001,46150,46136,Labastide-du-Vert,46,,,461360000D0693,,,,,,,,,,,,,0,,,,,T,terres,,,1525,1.24507,44.511782
2021-807404,2021-03-12,000001,Vente,7000,,,LE BATTANT,B001,46150,46136,Labastide-du-Vert,46,,,461360000D0694,,,,,,,,,,,,,0,,,,,P,prés,,,1205,1.244895,44.5113
2021-807404,2021-03-12,000001,Vente,7000,,,LE BATTANT,B001,46150,46136,Labastide-du-Vert,46,,,461360000D0695,,,,,,,,,,,,,0,,,,,P,prés,,,365,1.244622,44.511309
2021-807404,2021-03-12,000001,Vente,7000,,,LE BATTANT,B001,46150,46136,Labastide-du-Vert,46,,,461360000D0696,,,,,,,,,,,,,0,,,,,T,terres,,,980,1.244855,44.511728
2021-808016,2021-04-13,000001,Vente,124100,5153,,LA MOULINE,B051,46150,46136,Labastide-du-Vert,46,,,461360000D0892,,,,,,,,,,,,,0,1,Maison,88,4,L,landes,,,1500,1.256233,44.514019
2021-808016,2021-04-13,000001,Vente,124100,5153,,LA MOULINE,B051,46150,46136,Labastide-du-Vert,46,,,461360000D0892,,,,,,,,,,,,,0,3,Dépendance,,0,S,sols,,,500,1.256233,44.514019
2021-808016,2021-04-13,000001,Vente,124100,5153,,LA MOULINE,B051,46150,46136,Labastide-du-Vert,46,,,461360000D0892,,,,,,,,,,,,,0,1,Maison,88,4,S,sols,,,500,1.256233,44.514019
2021-808016,2021-04-13,000001,Vente,124100,5153,,LA MOULINE,B051,46150,46136,Labastide-du-Vert,46,,,461360000D0892,,,,,,,,,,,,,0,3,Dépendance,,0,L,landes,,,1500,1.256233,44.514019
2021-808718,2021-05-31,000001,Vente,81448,,,LES VIGNALS,B078,46150,46136,Labastide-du-Vert,46,,,461360000D0053,,,,,,,,,,,,,0,,,,,BT,taillis simples,,,5680,1.251258,44.523961
2021-808718,2021-05-31,000001,Vente,81448,,,BOUT DE LA COTE DE LA MASS,B006,46150,46136,Labastide-du-Vert,46,,,461360000D0142,,,,,,,,,,,,,0,,,,,BT,taillis simples,,,500,1.24336,44.521222
2021-808718,2021-05-31,000001,Vente,81448,,,BOUT DE LA COTE DE LA MASS,B006,46150,46136,Labastide-du-Vert,46,,,461360000D0145,,,,,,,,,,,,,0,,,,,BT,taillis simples,,,3405,1.242093,44.52157
2021-808718,2021-05-31,000001,Vente,81448,,,CHAMP DELLIS,B024,46150,46136,Labastide-du-Vert,46,,,461360000D0358,,,,,,,,,,,,,0,,,,,BT,taillis simples,,,1480,1.240016,44.518152
2021-808718,2021-05-31,000001,Vente,81448,,,LES CARBONIERES,B010,46150,46136,Labastide-du-Vert,46,,,461360000D0522,,,,,,,,,,,,,0,,,,,BT,taillis simples,,,975,1.25183,44.515206
2021-808718,2021-05-31,000001,Vente,81448,,,PECH DE RAYET,B053,46150,46136,Labastide-du-Vert,46,,,461360000D0747,,,,,,,,,,,,,0,,,,,L,landes,,,1420,1.250111,44.512596
2021-808925,2021-06-04,000001,Vente,23000,,,COMBEL DE LABOUYSSE,B038,46150,46136,Labastide-du-Vert,46,,,461360000B1189,,,,,,,,,,,,,0,,,,,BT,taillis simples,,,2502,1.286104,44.513584
2021-809239,2021-07-01,000001,Vente,1000,,,CHAMP DE LA FONT,B018,46150,46136,Labastide-du-Vert,46,,,461360000C0507,,,,,,,,,,,,,0,,,,,L,landes,,,5940,1.27124,44.501154
2021-809239,2021-07-01,000001,Vente,1000,,,CHAMP DE LA FONT,B018,46150,46136,Labastide-du-Vert,46,,,461360000C0508,,,,,,,,,,,,,0,,,,,L,landes,,,845,1.270721,44.501157
2021-809239,2021-07-01,000001,Vente,1000,,,CHAMP DE LA FONT,B018,46150,46136,Labastide-du-Vert,46,,,461360000C0509,,,,,,,,,,,,,0,,,,,L,landes,,,2005,1.270093,44.50101
2021-809239,2021-07-01,000001,Vente,1000,,,CHAMP DE LA FONT,B018,46150,46136,Labastide-du-Vert,46,,,461360000C0510,,,,,,,,,,,,,0,,,,,BT,taillis simples,,,6595,1.27053,44.500543
2021-809239,2021-07-01,000001,Vente,1000,,,CHAMP DE LA FONT,B018,46150,46136,Labastide-du-Vert,46,,,461360000C0514,,,,,,,,,,,,,0,,,,,L,landes,,,1090,1.272162,44.500623
2021-809685,2021-07-19,000001,Vente,25000,,,COMBEL DE LABOUYSSE,B038,46150,46136,Labastide-du-Vert,46,,,461360000B1187,,,,,,,,,,,,,0,,,,,BT,taillis simples,,,2143,1.286564,44.51359
2021-810204,2021-08-24,000001,Vente,35000,,,COMBEL DE LABOUYSSE,B038,46150,46136,Labastide-du-Vert,46,,,461360000B0282,,,,,,,,,,,,,0,,,,,S,sols,,,25,1.285209,44.510738
2021-810204,2021-08-24,000001,Vente,35000,,,COMBEL DE LABOUYSSE,B038,46150,46136,Labastide-du-Vert,46,,,461360000B0283,,,,,,,,,,,,,0,,,,,BT,taillis simples,,,690,1.285355,44.510589
2021-810204,2021-08-24,000001,Vente,35000,,,COMBEL DE LABOUYSSE,B038,46150,46136,Labastide-du-Vert,46,,,461360000B1179,,,,,,,,,,,,,0,,,,,BT,taillis simples,,,5991,1.284909,44.510371
2021-810204,2021-08-24,000001,Vente,35000,,,COMBEL DE LABOUYSSE,B038,46150,46136,Labastide-du-Vert,46,,,461360000B1183,,,,,,,,,,,,,0,,,,,T,terres,,,3224,1.285552,44.5108
2021-810757,2021-09-23,000001,Vente,405000,,,AU BOURG,B005,46150,46136,Labastide-du-Vert,46,,,461360000C0125,,,,,,,,,,,,,0,,,,,L,landes,,,1315,1.261763,44.510799
2021-810757,2021-09-23,000001,Vente,405000,,,AU BOURG,B005,46150,46136,Labastide-du-Vert,46,,,461360000C0126,,,,,,,,,,,,,0,,,,,P,prés,,,10065,1.261466,44.510371
2021-810757,2021-09-23,000001,Vente,405000,,,MARQUAYROL,B048,46150,46136,Labastide-du-Vert,46,,,461360000C0260,,,,,,,,,,,,,0,,,,,T,terres,,,1080,1.251314,44.509088
2021-810757,2021-09-23,000001,Vente,405000,,,MARQUAYROL,B048,46150,46136,Labastide-du-Vert,46,,,461360000C0262,,,,,,,,,,,,,0,,,,,L,landes,,,40980,1.255422,44.509981
2021-810757,2021-09-23,000001,Vente,405000,,,MARQUAYROL,B048,46150,46136,Labastide-du-Vert,46,,,461360000C0262,,,,,,,,,,,,,0,,,,,L,landes,,,40980,1.255422,44.509981
2021-810757,2021-09-23,000001,Vente,405000,,,MARQUAYROL,B048,46150,46136,Labastide-du-Vert,46,,,461360000C0263,,,,,,,,,,,,,0,,,,,T,terres,,,3705,1.254629,44.509437
2021-810757,2021-09-23,000001,Vente,405000,,,MARQUAYROL,B048,46150,46136,Labastide-du-Vert,46,,,461360000C0264,,,,,,,,,,,,,0,,,,,T,terres,,,1090,1.255543,44.510132
2021-810757,2021-09-23,000001,Vente,405000,,,MARQUAYROL,B048,46150,46136,Labastide-du-Vert,46,,,461360000C0265,,,,,,,,,,,,,0,,,,,T,terres,,,1045,1.256485,44.510335
2021-810757,2021-09-23,000001,Vente,405000,5093,,MARQUAYROL,B048,46150,46136,Labastide-du-Vert,46,,,461360000C0266,,,,,,,,,,,,,0,1,Maison,94,1,S,sols,,,140,1.256986,44.510782
2021-810757,2021-09-23,000001,Vente,405000,,,MARQUAYROL,B048,46150,46136,Labastide-du-Vert,46,,,461360000C0267,,,,,,,,,,,,,0,,,,,L,landes,,,7100,1.258615,44.510303
2021-810757,2021-09-23,000001,Vente,405000,,,MARQUAYROL,B048,46150,46136,Labastide-du-Vert,46,,,461360000C0268,,,,,,,,,,,,,0,,,,,T,terres,,,7955,1.259419,44.510587
2021-810757,2021-09-23,000001,Vente,405000,,,MARQUAYROL,B048,46150,46136,Labastide-du-Vert,46,,,461360000C0269,,,,,,,,,,,,,0,,,,,P,prés,,,1310,1.258002,44.510917
2021-810757,2021-09-23,000001,Vente,405000,,,MARQUAYROL,B048,46150,46136,Labastide-du-Vert,46,,,461360000C0270,,,,,,,,,,,,,0,,,,,L,landes,,,25360,1.254621,44.510805
2021-810757,2021-09-23,000001,Vente,405000,,,MARQUAYROL,B048,46150,46136,Labastide-du-Vert,46,,,461360000C0271,,,,,,,,,,,,,0,,,,,BT,taillis simples,,,3295,1.259691,44.511073
2021-810757,2021-09-23,000001,Vente,405000,,,MARQUAYROL,B048,46150,46136,Labastide-du-Vert,46,,,461360000C0272,,,,,,,,,,,,,0,,,,,BT,taillis simples,,,2360,1.260768,44.511209
2021-810757,2021-09-23,000001,Vente,405000,,,MARQUAYROL,B048,46150,46136,Labastide-du-Vert,46,,,461360000C0273,,,,,,,,,,,,,0,,,,,P,prés,,,3280,1.260506,44.510726
2021-810757,2021-09-23,000001,Vente,405000,5092,,MARQUAYROL,B048,46150,46136,Labastide-du-Vert,46,,,461360000C0274,,,,,,,,,,,,,0,1,Maison,380,7,S,sols,,,3260,1.260212,44.51069
2021-810757,2021-09-23,000001,Vente,405000,,,MARQUAYROL,B048,46150,46136,Labastide-du-Vert,46,,,461360000C0275,,,,,,,,,,,,,0,,,,,S,sols,,,60,1.259783,44.510507
2021-810757,2021-09-23,000001,Vente,405000,,,MARQUAYROL,B048,46150,46136,Labastide-du-Vert,46,,,461360000C0276,,,,,,,,,,,,,0,,,,,J,jardins,POTAG,Jardin potager,1270,1.260062,44.510265
2021-810757,2021-09-23,000001,Vente,405000,5094,,MARQUAYROL,B048,46150,46136,Labastide-du-Vert,46,,,461360000C0277,,,,,,,,,,,,,0,1,Maison,36,3,S,sols,,,810,1.260153,44.510113
2021-810757,2021-09-23,000001,Vente,405000,,,MARQUAYROL,B048,46150,46136,Labastide-du-Vert,46,,,461360000C0278,,,,,,,,,,,,,0,,,,,T,terres,,,1210,1.260365,44.509852
2021-810757,2021-09-23,000001,Vente,405000,,,MARQUAYROL,B048,46150,46136,Labastide-du-Vert,46,,,461360000C0279,,,,,,,,,,,,,0,,,,,T,terres,,,1051,1.260883,44.509505
2021-810757,2021-09-23,000001,Vente,405000,,,MARQUAYROL,B048,46150,46136,Labastide-du-Vert,46,,,461360000C0280,,,,,,,,,,,,,0,,,,,T,terres,,,1350,1.261384,44.509791
2021-810757,2021-09-23,000001,Vente,405000,,,MARQUAYROL,B048,46150,46136,Labastide-du-Vert,46,,,461360000C0281,,,,,,,,,,,,,0,,,,,BT,taillis simples,,,1240,1.262036,44.510156
2021-810757,2021-09-23,000001,Vente,405000,,,MARQUAYROL,B048,46150,46136,Labastide-du-Vert,46,,,461360000C0282,,,,,,,,,,,,,0,,,,,T,terres,,,1360,1.261705,44.509519
2021-810757,2021-09-23,000001,Vente,405000,,,MARQUAYROL,B048,46150,46136,Labastide-du-Vert,46,,,461360000C0283,,,,,,,,,,,,,0,,,,,L,landes,,,1620,1.261212,44.509172
2021-810757,2021-09-23,000001,Vente,405000,,,MARQUAYROL,B048,46150,46136,Labastide-du-Vert,46,,,461360000C0284,,,,,,,,,,,,,0,,,,,T,terres,,,785,1.260884,44.508972
2021-810757,2021-09-23,000001,Vente,405000,,,MARQUAYROL,B048,46150,46136,Labastide-du-Vert,46,,,461360000C0285,,,,,,,,,,,,,0,,,,,BS,taillis sous futaie,,,5100,1.259553,44.509361
2021-810757,2021-09-23,000001,Vente,405000,,,MARQUAYROL,B048,46150,46136,Labastide-du-Vert,46,,,461360000C0285,,,,,,,,,,,,,0,,,,,BT,taillis simples,,,5100,1.259553,44.509361
2021-810757,2021-09-23,000001,Vente,405000,,,MARQUAYROL,B048,46150,46136,Labastide-du-Vert,46,,,461360000C0286,,,,,,,,,,,,,0,,,,,BT,taillis simples,,,3625,1.259081,44.50985
2021-810757,2021-09-23,000001,Vente,405000,,,MARQUAYROL,B048,46150,46136,Labastide-du-Vert,46,,,461360000C0286,,,,,,,,,,,,,0,,,,,BT,taillis simples,,,3625,1.259081,44.50985
2021-810757,2021-09-23,000001,Vente,405000,,,MARQUAYROL,B048,46150,46136,Labastide-du-Vert,46,,,461360000C0287,,,,,,,,,,,,,0,,,,,T,terres,,,915,1.257058,44.510252
2021-810757,2021-09-23,000001,Vente,405000,,,MARQUAYROL,B048,46150,46136,Labastide-du-Vert,46,,,461360000C0288,,,,,,,,,,,,,0,,,,,S,sols,,,15,1.256984,44.510054
2021-810757,2021-09-23,000001,Vente,405000,,,MARQUAYROL,B048,46150,46136,Labastide-du-Vert,46,,,461360000C0289,,,,,,,,,,,,,0,,,,,L,landes,,,11175,1.257507,44.509637
2021-810757,2021-09-23,000001,Vente,405000,,,MARQUAYROL,B048,46150,46136,Labastide-du-Vert,46,,,461360000C0290,,,,,,,,,,,,,0,,,,,T,terres,,,2180,1.257879,44.509236
2021-810757,2021-09-23,000001,Vente,405000,,,MARQUAYROL,B048,46150,46136,Labastide-du-Vert,46,,,461360000C0291,,,,,,,,,,,,,0,,,,,BT,taillis simples,,,7675,1.258708,44.508999
2021-810757,2021-09-23,000001,Vente,405000,,,MARQUAYROL,B048,46150,46136,Labastide-du-Vert,46,,,461360000C0292,,,,,,,,,,,,,0,,,,,BS,taillis sous futaie,,,5400,1.259555,44.508662
2021-810757,2021-09-23,000001,Vente,405000,,,MARQUAYROL,B048,46150,46136,Labastide-du-Vert,46,,,461360000C0307,,,,,,,,,,,,,0,,,,,L,landes,,,10265,1.257985,44.508417
2021-810757,2021-09-23,000001,Vente,405000,,,MARQUAYROL,B048,46150,46136,Labastide-du-Vert,46,,,461360000C0310,,,,,,,,,,,,,0,,,,,BT,taillis simples,,,875,1.25686,44.509652
2021-810757,2021-09-23,000001,Vente,405000,,,MARQUAYROL,B048,46150,46136,Labastide-du-Vert,46,,,461360000C0343,,,,,,,,,,,,,0,,,,,L,landes,,,2490,1.256446,44.505005
2021-810757,2021-09-23,000001,Vente,405000,,,MARQUAYROL,B048,46150,46136,Labastide-du-Vert,46,,,461360000C0348,,,,,,,,,,,,,0,,,,,L,landes,,,2925,1.25791,44.505012
2021-810757,2021-09-23,000001,Vente,405000,,,MARQUAYROL,B048,46150,46136,Labastide-du-Vert,46,,,461360000C0349,,,,,,,,,,,,,0,,,,,T,terres,,,1900,1.257451,44.505431
2021-810757,2021-09-23,000001,Vente,405000,,,MARQUAYROL,B048,46150,46136,Labastide-du-Vert,46,,,461360000C0350,,,,,,,,,,,,,0,,,,,T,terres,,,920,1.257293,44.505691
2021-810757,2021-09-23,000001,Vente,405000,,,MARQUAYROL,B048,46150,46136,Labastide-du-Vert,46,,,461360000C0351,,,,,,,,,,,,,0,,,,,L,landes,,,1860,1.257123,44.506017
2021-811108,2021-10-01,000001,Vente,1000,,,AU BOURG,B005,46150,46136,Labastide-du-Vert,46,,,461360000C0194,,,,,,,,,,,,,0,,,,,L,landes,,,85,1.26309,44.511832
2021-811108,2021-10-01,000001,Vente,1000,,,AU BOURG,B005,46150,46136,Labastide-du-Vert,46,,,461360000C0739,,,,,,,,,,,,,0,,,,,L,landes,,,45,1.263058,44.5119
2021-811108,2021-10-01,000001,Vente,1000,,,AU BOURG,B005,46150,46136,Labastide-du-Vert,46,,,461360000C0740,,,,,,,,,,,,,0,,,,,L,landes,,,7,1.263124,44.511861
2021-811108,2021-10-01,000001,Vente,1000,,,CALVIGNAC,B008,46150,46136,Labastide-du-Vert,46,,,461360000C0741,,,,,,,,,,,,,0,,,,,L,landes,,,7,1.262961,44.511908
2021-811418,2021-10-29,000001,Vente,143000,5084,,AU BOURG,B005,46150,46136,Labastide-du-Vert,46,,,461360000C0138,,,,,,,,,,,,,0,1,Maison,67,3,S,sols,,,775,1.262723,44.511387
2021-811418,2021-10-29,000001,Vente,143000,5084,,AU BOURG,B005,46150,46136,Labastide-du-Vert,46,,,461360000C0138,,,,,,,,,,,,,0,3,Dépendance,,0,S,sols,,,775,1.262723,44.511387
2021-811418,2021-10-29,000001,Vente,143000,,,AU BOURG,B005,46150,46136,Labastide-du-Vert,46,,,461360000C0139,,,,,,,,,,,,,0,,,,,T,terres,,,440,1.262667,44.511239
2021-812686,2021-12-03,000001,Vente,140000,,,LES DEVEZ,B044,46150,46136,Labastide-du-Vert,46,,,461360000A0981,,,,,,,,,,,,,0,,,,,T,terres,,,291,1.267635,44.513475
2021-812686,2021-12-03,000001,Vente,140000,,,LA COMBE DES ESTAUSSOUS,B034,46150,46136,Labastide-du-Vert,46,,,461360000B0764,,,,,,,,,,,,,0,,,,,L,landes,,,21155,1.266877,44.511049
2021-812686,2021-12-03,000001,Vente,140000,,,LA COMBE DES ESTAUSSOUS,B034,46150,46136,Labastide-du-Vert,46,,,461360000B0765,,,,,,,,,,,,,0,,,,,T,terres,,,4570,1.267419,44.511807
2021-812686,2021-12-03,000001,Vente,140000,,,LA COMBE DES ESTAUSSOUS,B034,46150,46136,Labastide-du-Vert,46,,,461360000B0766,,,,,,,,,,,,,0,,,,,T,terres,,,1360,1.267687,44.511215
2021-812686,2021-12-03,000001,Vente,140000,,,AU BOURG,B005,46150,46136,Labastide-du-Vert,46,,,461360000C0070,,,,,,,,,,,,,0,,,,,S,sols,,,110,1.266951,44.512754
2021-812686,2021-12-03,000001,Vente,140000,,,AU BOURG,B005,46150,46136,Labastide-du-Vert,46,,,461360000C0071,,,,,,,,,,,,,0,,,,,J,jardins,POTAG,Jardin potager,125,1.267016,44.512628
2021-812686,2021-12-03,000001,Vente,140000,,,AU BOURG,B005,46150,46136,Labastide-du-Vert,46,,,461360000C0072,,,,,,,,,,,,,0,,,,,S,sols,,,565,1.266864,44.512678
2021-812686,2021-12-03,000001,Vente,140000,,,AU BOURG,B005,46150,46136,Labastide-du-Vert,46,,,461360000C0073,,,,,,,,,,,,,0,,,,,S,sols,,,203,1.266888,44.512455
2021-812686,2021-12-03,000001,Vente,140000,,,AU BOURG,B005,46150,46136,Labastide-du-Vert,46,,,461360000C0629,,,,,,,,,,,,,0,,,,,S,sols,,,27,1.26691,44.512461
2021-812686,2021-12-03,000001,Vente,140000,,,AU BOURG,B005,46150,46136,Labastide-du-Vert,46,,,461360000C0708,,,,,,,,,,,,,0,,,,,L,landes,,,5482,1.266047,44.512372
2021-812686,2021-12-03,000001,Vente,140000,5051,,AU BOURG,B005,46150,46136,Labastide-du-Vert,46,,,461360000C0710,,,,,,,,,,,,,0,3,Dépendance,,0,S,sols,,,1120,1.266683,44.512594
2021-812686,2021-12-03,000001,Vente,140000,5051,,AU BOURG,B005,46150,46136,Labastide-du-Vert,46,,,461360000C0710,,,,,,,,,,,,,0,1,Maison,200,1,S,sols,,,1120,1.266683,44.512594
