id_mutation,date_mutation,numero_disposition,nature_mutation,valeur_fonciere,adresse_numero,adresse_suffixe,adresse_nom_voie,adresse_code_voie,code_postal,code_commune,nom_commune,code_departement,ancien_code_commune,ancien_nom_commune,id_parcelle,ancien_id_parcelle,numero_volume,lot1_numero,lot1_surface_carrez,lot2_numero,lot2_surface_carrez,lot3_numero,lot3_surface_carrez,lot4_numero,lot4_surface_carrez,lot5_numero,lot5_surface_carrez,nombre_lots,code_type_local,type_local,surface_reelle_bati,nombre_pieces_principales,code_nature_culture,nature_culture,code_nature_culture_speciale,nature_culture_speciale,surface_terrain,longitude,latitude
2021-807031,2021-02-02,000001,Vente,2304,,,BOURNAGUETS,B006,46260,46230,Puyjourdes,46,,,46230000AI0031,,,,,,,,,,,,,0,,,,,L,landes,,,4460,1.848117,44.395005
2021-807031,2021-02-02,000001,Vente,2304,,,BOURNAGUETS,B006,46260,46230,Puyjourdes,46,,,46230000AI0032,,,,,,,,,,,,,0,,,,,L,landes,,,7090,1.847502,44.395252
2021-808062,2021-04-08,000002,Vente,4000,,,SOULIERS,B079,46260,46230,Puyjourdes,46,,,46230000AB0253,,,,,,,,,,,,,0,,,,,T,terres,,,1987,1.856317,44.405034
2021-808988,2021-06-03,000001,Vente,1000,,,GLOUPATIERES,B045,46260,46230,Puyjourdes,46,,,46230000AB0055,,,,,,,,,,,,,0,,,,,L,landes,,,7015,1.854242,44.41173
2021-809171,2021-06-09,000001,Vente,2000,,,LE TRUC,B082,46260,46230,Puyjourdes,46,,,46230000AE0200,,,,,,,,,,,,,0,,,,,L,landes,,,4950,1.866449,44.404324
2021-809171,2021-06-09,000001,Vente,2000,,,LE TRUC,B082,46260,46230,Puyjourdes,46,,,46230000AE0201,,,,,,,,,,,,,0,,,,,L,landes,,,10980,1.867537,44.405017
2021-809171,2021-06-09,000001,Vente,2000,,,LE TRUC,B082,46260,46230,Puyjourdes,46,,,46230000AE0202,,,,,,,,,,,,,0,,,,,T,terres,,,4595,1.866772,44.40526
2021-809791,2021-07-28,000001,Vente,185000,,,PUYJOURDES,B075,46260,46230,Puyjourdes,46,,,46230000AC0067,,,,,,,,,,,,,0,,,,,L,landes,,,1578,1.862957,44.406824
2021-809791,2021-07-28,000001,Vente,185000,,,PUYJOURDES,B075,46260,46230,Puyjourdes,46,,,46230000AC0068,,,,,,,,,,,,,0,,,,,T,terres,,,2418,1.863577,44.407118
2021-809791,2021-07-28,000001,Vente,185000,5058,F,PUYJOURDES,B075,46260,46230,Puyjourdes,46,,,46230000AC0213,,,,,,,,,,,,,0,1,Maison,113,3,S,sols,,,1246,1.862774,44.406541
2021-809791,2021-07-28,000001,Vente,185000,,,CLOUP BAYSSOU,B034,46260,46230,Puyjourdes,46,,,46230000AI0006,,,,,,,,,,,,,0,,,,,BT,taillis simples,,,4447,1.846108,44.389313
2021-810439,2021-08-20,000001,Vente,1000,,,LES CLAUS LONGS,B031,46260,46230,Puyjourdes,46,,,46230000AL0044,,,,,,,,,,,,,0,,,,,BT,taillis simples,,,5000,1.838045,44.398997
2021-810439,2021-08-20,000001,Vente,1000,,,LES CLAUS LONGS,B031,46260,46230,Puyjourdes,46,,,46230000AL0046,,,,,,,,,,,,,0,,,,,BT,taillis simples,,,6468,1.838894,44.399804
2021-811355,2021-10-14,000001,Vente,396450,5018,F,AU MOULIN,B057,46260,46230,Puyjourdes,46,,,46230000AH0018,,,,,,,,,,,,,0,1,Maison,93,3,L,landes,,,3795,1.862265,44.39762
2021-811355,2021-10-14,000001,Vente,396450,5018,F,AU MOULIN,B057,46260,46230,Puyjourdes,46,,,46230000AH0018,,,,,,,,,,,,,0,3,Dépendance,,0,S,sols,,,500,1.862265,44.39762
2021-811355,2021-10-14,000001,Vente,396450,5018,F,AU MOULIN,B057,46260,46230,Puyjourdes,46,,,46230000AH0018,,,,,,,,,,,,,0,1,Maison,93,3,S,sols,,,500,1.862265,44.39762
2021-811355,2021-10-14,000001,Vente,396450,5018,F,AU MOULIN,B057,46260,46230,Puyjourdes,46,,,46230000AH0018,,,,,,,,,,,,,0,3,Dépendance,,0,L,landes,,,3795,1.862265,44.39762
2021-811355,2021-10-14,000001,Vente,396450,5018,F,AU MOULIN,B057,46260,46230,Puyjourdes,46,,,46230000AH0018,,,,,,,,,,,,,0,3,Dépendance,,0,L,landes,,,3795,1.862265,44.39762
2021-811355,2021-10-14,000001,Vente,396450,5018,F,AU MOULIN,B057,46260,46230,Puyjourdes,46,,,46230000AH0018,,,,,,,,,,,,,0,3,Dépendance,,0,S,sols,,,500,1.862265,44.39762
2021-811355,2021-10-14,000001,Vente,396450,,,AU MOULIN,B057,46260,46230,Puyjourdes,46,,,46230000AH0019,,,,,,,,,,,,,0,,,,,L,landes,,,445,1.861977,44.397599
2021-811355,2021-10-14,000001,Vente,396450,5045,,AU MOULIN,B057,46260,46230,Puyjourdes,46,,,46230000AH0020,,,,,,,,,,,,,0,1,Maison,42,1,S,sols,,,240,1.861862,44.397701
2021-811355,2021-10-14,000001,Vente,396450,,,AU MOULIN,B057,46260,46230,Puyjourdes,46,,,46230000AH0021,,,,,,,,,,,,,0,,,,,S,sols,,,100,1.861963,44.397816
2021-811355,2021-10-14,000001,Vente,396450,,,AU MOULIN,B057,46260,46230,Puyjourdes,46,,,46230000AH0021,,,,,,,,,,,,,0,,,,,L,landes,,,520,1.861963,44.397816
2021-811355,2021-10-14,000001,Vente,396450,,,AU MOULIN,B057,46260,46230,Puyjourdes,46,,,46230000AH0022,,,,,,,,,,,,,0,,,,,L,landes,,,160,1.862113,44.398006
2021-811355,2021-10-14,000001,Vente,396450,,,AU MOULIN,B057,46260,46230,Puyjourdes,46,,,46230000AH0187,,,,,,,,,,,,,0,,,,,L,landes,,,7096,1.862741,44.397398
2021-812798,2021-12-30,000001,Vente,97000,,,SOULIERS,B079,46260,46230,Puyjourdes,46,,,46230000AE0008,,,,,,,,,,,,,0,,,,,S,sols,,,55,1.856929,44.404165
2021-812798,2021-12-30,000001,Vente,97000,5037,,SOULIERS,B079,46260,46230,Puyjourdes,46,,,46230000AE0010,,,,,,,,,,,,,0,1,Maison,88,2,S,sols,,,835,1.856638,44.403837
2021-812798,2021-12-30,000001,Vente,97000,,,SOULIERS,B079,46260,46230,Puyjourdes,46,,,46230000AE0011,,,,,,,,,,,,,0,,,,,L,landes,,,380,1.856698,44.404049
2021-812798,2021-12-30,000001,Vente,97000,,,SOULIERS,B079,46260,46230,Puyjourdes,46,,,46230000AE0289,,,,,,,,,,,,,0,,,,,S,sols,,,1339,1.856549,44.40417
