id_mutation,date_mutation,numero_disposition,nature_mutation,valeur_fonciere,adresse_numero,adresse_suffixe,adresse_nom_voie,adresse_code_voie,code_postal,code_commune,nom_commune,code_departement,ancien_code_commune,ancien_nom_commune,id_parcelle,ancien_id_parcelle,numero_volume,lot1_numero,lot1_surface_carrez,lot2_numero,lot2_surface_carrez,lot3_numero,lot3_surface_carrez,lot4_numero,lot4_surface_carrez,lot5_numero,lot5_surface_carrez,nombre_lots,code_type_local,type_local,surface_reelle_bati,nombre_pieces_principales,code_nature_culture,nature_culture,code_nature_culture_speciale,nature_culture_speciale,surface_terrain,longitude,latitude
2021-823156,2021-03-10,000002,Vente,500,5014,,SAINTE HELENE VILLAGE,B368,48190,48157,Sainte-Hélène,48,,,481570000B0681,,,,,,,,,,,,,0,,,,,S,sols,,,77,3.602712,44.518924
2021-823619,2021-05-14,000001,Vente,1000,,,SAINTE HELENE VILLAGE,B368,48190,48157,Sainte-Hélène,48,,,481570000B0444,,,,,,,,,,,,,0,,,,,J,jardins,,,95,3.60326,44.518604
2021-824365,2021-08-25,000001,Vente,138000,5116,,MOULIN,B287,48190,48157,Sainte-Hélène,48,,,481570000A0200,,,,,,,,,,,,,0,1,Maison,18,1,S,sols,,,36,3.602606,44.522907
2021-824365,2021-08-25,000001,Vente,138000,,,PRAT DEL POUON,B324,48190,48157,Sainte-Hélène,48,,,481570000A0318,,,,,,,,,,,,,0,,,,,P,prés,,,1,3.603174,44.523273
2021-824365,2021-08-25,000001,Vente,138000,,,PRAT DEL POUON,B324,48190,48157,Sainte-Hélène,48,,,481570000A0326,,,,,,,,,,,,,0,,,,,P,prés,,,1600,3.602673,44.523489
2021-824365,2021-08-25,000001,Vente,138000,,,PRAT DEL POUON,B324,48190,48157,Sainte-Hélène,48,,,481570000A0326,,,,,,,,,,,,,0,,,,,P,prés,,,307,3.602673,44.523489
2021-824365,2021-08-25,000001,Vente,138000,,,PRAT DEL POUON,B324,48190,48157,Sainte-Hélène,48,,,481570000A0328,,,,,,,,,,,,,0,,,,,P,prés,,,1600,3.602964,44.523157
2021-824365,2021-08-25,000001,Vente,138000,,,PRAT DEL POUON,B324,48190,48157,Sainte-Hélène,48,,,481570000A0328,,,,,,,,,,,,,0,,,,,P,prés,,,292,3.602964,44.523157
2021-824365,2021-08-25,000001,Vente,138000,,,PRAT DEL POUON,B324,48190,48157,Sainte-Hélène,48,,,481570000A0330,,,,,,,,,,,,,0,,,,,P,prés,,,1800,3.602942,44.522887
2021-824365,2021-08-25,000001,Vente,138000,,,PRAT DEL POUON,B324,48190,48157,Sainte-Hélène,48,,,481570000A0330,,,,,,,,,,,,,0,,,,,P,prés,,,361,3.602942,44.522887
2021-824847,2021-10-12,000002,Vente,45000,,,LOU DEVES,B238,48190,48157,Sainte-Hélène,48,,,481570000A0365,,,,,,,,,,,,,0,,,,,L,landes,,,2224,3.604966,44.523784
