id_mutation,date_mutation,numero_disposition,nature_mutation,valeur_fonciere,adresse_numero,adresse_suffixe,adresse_nom_voie,adresse_code_voie,code_postal,code_commune,nom_commune,code_departement,ancien_code_commune,ancien_nom_commune,id_parcelle,ancien_id_parcelle,numero_volume,lot1_numero,lot1_surface_carrez,lot2_numero,lot2_surface_carrez,lot3_numero,lot3_surface_carrez,lot4_numero,lot4_surface_carrez,lot5_numero,lot5_surface_carrez,nombre_lots,code_type_local,type_local,surface_reelle_bati,nombre_pieces_principales,code_nature_culture,nature_culture,code_nature_culture_speciale,nature_culture_speciale,surface_terrain,longitude,latitude
2021-1049455,2021-01-14,000001,Vente,46000,7,,RUE VICTOR HUGO,0064,62250,62329,Ferques,62,,,62329000AH0103,,,,,,,,,,,,,0,1,Maison,81,4,S,sols,,,123,1.759419,50.829778
2021-1049711,2021-02-01,000001,Vente,165000,3,,RUE DES RAMONETTES,0063,62250,62329,Ferques,62,,,62329000AA0054,,,,,,,,,,,,,0,1,Maison,114,5,S,sols,,,1267,1.753627,50.837045
2021-1050302,2021-03-22,000001,Vente,35000,,,ELINGHEM,B014,62250,62329,Ferques,62,,,62329000AC0126,,,,,,,,,,,,,0,,,,,J,jardins,,,364,1.777794,50.821434
2021-1050302,2021-03-22,000001,Vente,35000,,,ELINGHEM,B014,62250,62329,Ferques,62,,,62329000AC0127,,,,,,,,,,,,,0,,,,,J,jardins,,,364,1.777816,50.821314
2021-1050302,2021-03-22,000001,Vente,35000,,,ELINGHEM,B014,62250,62329,Ferques,62,,,62329000AC0134,,,,,,,,,,,,,0,,,,,S,sols,,,169,1.778195,50.821401
2021-1050409,2021-03-26,000001,Vente,10000,,,L ENTRE DEUX VILLES,B016,62250,62329,Ferques,62,,,62329000AD0071,,,,,,,,,,,,,0,,,,,J,jardins,,,144,1.759347,50.833658
2021-1050805,2021-04-09,000001,Vente,204200,,,LE POINT DU JOUR,B035,62250,62329,Ferques,62,,,623290000A0410,,,,,,,,,,,,,0,,,,,J,jardins,,,1227,1.772027,50.834584
2021-1050805,2021-04-09,000001,Vente,204200,9,,RUE DU POINT DU JOUR,0035,62250,62329,Ferques,62,,,623290000A0411,,,,,,,,,,,,,0,1,Maison,78,4,S,sols,,,556,1.772494,50.834534
2021-1050849,2021-04-30,000002,Vente,120000,30,,RUE LOUIS LE SENECHAL,0066,62250,62329,Ferques,62,,,62329000AE0103,,,,,,,,,,,,,0,1,Maison,104,3,S,sols,,,530,1.762572,50.835648
2021-1050849,2021-04-30,000002,Vente,120000,30,,RUE LOUIS LE SENECHAL,0066,62250,62329,Ferques,62,,,62329000AE0103,,,,,,,,,,,,,0,1,Maison,96,4,S,sols,,,530,1.762572,50.835648
2021-1050874,2021-04-27,000001,Vente,20000,,,ELINGHEM,B014,62250,62329,Ferques,62,,,62329000AC0131,,,,,,,,,,,,,0,,,,,J,jardins,,,364,1.778145,50.821059
2021-1050874,2021-04-27,000001,Vente,20000,,,ELINGHEM,B014,62250,62329,Ferques,62,,,62329000AC0134,,,,,,,,,,,,,0,,,,,S,sols,,,169,1.778195,50.821401
2021-1050990,2021-05-07,000001,Vente,108000,55,,RUE LOUIS LE SENECHAL,0066,62250,62329,Ferques,62,,,62329000AB0226,,,,,,,,,,,,,0,3,Dépendance,,0,S,sols,,,671,1.765474,50.837436
2021-1050990,2021-05-07,000001,Vente,108000,55,,RUE LOUIS LE SENECHAL,0066,62250,62329,Ferques,62,,,62329000AB0226,,,,,,,,,,,,,0,1,Maison,76,3,S,sols,,,671,1.765474,50.837436
2021-1050990,2021-05-07,000001,Vente,108000,55,,RUE LOUIS LE SENECHAL,0066,62250,62329,Ferques,62,,,62329000AB0226,,,,,,,,,,,,,0,3,Dépendance,,0,S,sols,,,671,1.765474,50.837436
2021-1051594,2021-06-10,000001,Vente,288000,42,A,RUE LOUIS LE SENECHAL,0066,62250,62329,Ferques,62,,,62329000AE0020,,,,,,,,,,,,,0,1,Maison,168,4,S,sols,,,1000,1.765063,50.836433
2021-1051594,2021-06-10,000001,Vente,288000,42,A,RUE LOUIS LE SENECHAL,0066,62250,62329,Ferques,62,,,62329000AE0020,,,,,,,,,,,,,0,1,Maison,168,4,AG,terrains d'agrément,,,669,1.765063,50.836433
2021-1051620,2021-05-26,000001,Vente,90700,5,,RUE VICTOR HUGO,0064,62250,62329,Ferques,62,,,62329000AH0104,,,,,,,,,,,,,0,1,Maison,81,4,S,sols,,,118,1.759368,50.829729
2021-1051876,2021-06-17,000001,Vente,95000,49,,RUE LOUIS LE SENECHAL,0066,62250,62329,Ferques,62,,,62329000AD0016,,,,,,,,,,,,,0,1,Maison,54,3,J,jardins,,,565,1.762076,50.836211
2021-1051876,2021-06-17,000001,Vente,95000,49,,RUE LOUIS LE SENECHAL,0066,62250,62329,Ferques,62,,,62329000AD0016,,,,,,,,,,,,,0,3,Dépendance,,0,J,jardins,,,565,1.762076,50.836211
2021-1051876,2021-06-17,000001,Vente,95000,49,,RUE LOUIS LE SENECHAL,0066,62250,62329,Ferques,62,,,62329000AD0016,,,,,,,,,,,,,0,3,Dépendance,,0,S,sols,,,300,1.762076,50.836211
2021-1051876,2021-06-17,000001,Vente,95000,49,,RUE LOUIS LE SENECHAL,0066,62250,62329,Ferques,62,,,62329000AD0016,,,,,,,,,,,,,0,1,Maison,54,3,S,sols,,,300,1.762076,50.836211
2021-1052068,2021-07-06,000001,Vente,130000,48,,RUE LOUIS LE SENECHAL,0066,62250,62329,Ferques,62,,,62329000AE0010,,,,,,,,,,,,,0,1,Maison,86,5,S,sols,,,690,1.766913,50.837389
2021-1052094,2021-07-12,000001,Vente,170172,4,,RUE ANDRE PERET,0006,62250,62329,Ferques,62,,,62329000AE0098,,,,,,,,,,,,,0,1,Maison,85,4,P,prés,,,411,1.76065,50.833669
2021-1052170,2021-06-21,000001,Vente,235200,26,,RUE DU COLONEL,0031,62250,62329,Ferques,62,,,62329000AB0268,,,,,,,,,,,,,0,1,Maison,134,5,AB,terrains a bâtir,,,900,1.761234,50.839082
2021-1052176,2021-06-22,000001,Vente,105000,20,,RUE DES CARRIERES,0017,62250,62329,Ferques,62,,,62329000AB0084,,,,,,,,,,,,,0,3,Dépendance,,0,S,sols,,,480,1.759535,50.837618
2021-1052176,2021-06-22,000001,Vente,105000,20,,RUE DES CARRIERES,0017,62250,62329,Ferques,62,,,62329000AB0084,,,,,,,,,,,,,0,1,Maison,126,6,S,sols,,,480,1.759535,50.837618
2021-1052325,2021-07-08,000001,Vente,145000,4,,RUE DU MONT SAINT PIERRE,0036,62250,62329,Ferques,62,,,62329000AK0033,,,,,,,,,,,,,0,1,Maison,133,5,S,sols,,,517,1.77519,50.818448
2021-1052411,2021-07-21,000001,Vente,230000,10,,RUE RAYMOND POINCARE,0065,62250,62329,Ferques,62,,,62329000AI0054,,,,,,,,,,,,,0,1,Maison,87,4,S,sols,,,980,1.779582,50.823072
2021-1052411,2021-07-21,000001,Vente,230000,10,,RUE RAYMOND POINCARE,0065,62250,62329,Ferques,62,,,62329000AI0054,,,,,,,,,,,,,0,3,Dépendance,,0,S,sols,,,980,1.779582,50.823072
2021-1052635,2021-07-23,000001,Vente,108000,,,ELINGHEM,B014,62250,62329,Ferques,62,,,62329000AC0258,,,,,,,,,,,,,0,,,,,J,jardins,,,352,1.778694,50.821095
2021-1052635,2021-07-23,000001,Vente,108000,,,ELINGHEM,B014,62250,62329,Ferques,62,,,62329000AC0260,,1,,,,,,,,,,,0,,,,,,,,,,1.778934,50.820951
2021-1052635,2021-07-23,000001,Vente,108000,,,ELINGHEM,B014,62250,62329,Ferques,62,,,62329000AC0260,,3,,,,,,,,,,,0,,,,,,,,,,1.778934,50.820951
2021-1052638,2021-07-23,000001,Vente,98000,,,ELINGHEM,B014,62250,62329,Ferques,62,,,62329000AC0259,,,,,,,,,,,,,0,,,,,J,jardins,,,388,1.778796,50.8212
2021-1052638,2021-07-23,000001,Vente,98000,,,ELINGHEM,B014,62250,62329,Ferques,62,,,62329000AC0260,,2,,,,,,,,,,,0,,,,,,,,,,1.778934,50.820951
2021-1052638,2021-07-23,000001,Vente,98000,,,ELINGHEM,B014,62250,62329,Ferques,62,,,62329000AC0260,,4,,,,,,,,,,,0,,,,,,,,,,1.778934,50.820951
2021-1052638,2021-07-23,000001,Vente,98000,39,,RUE DU MONT SAINT PIERRE,0036,62250,62329,Ferques,62,,,62329000AC0261,,,,,,,,,,,,,0,3,Dépendance,,0,S,sols,,,256,1.779004,50.821032
2021-1052638,2021-07-23,000001,Vente,98000,39,,RUE DU MONT SAINT PIERRE,0036,62250,62329,Ferques,62,,,62329000AC0261,,,,,,,,,,,,,0,3,Dépendance,,0,S,sols,,,256,1.779004,50.821032
2021-1052638,2021-07-23,000001,Vente,98000,39,,RUE DU MONT SAINT PIERRE,0036,62250,62329,Ferques,62,,,62329000AC0261,,,,,,,,,,,,,0,1,Maison,100,5,S,sols,,,256,1.779004,50.821032
2021-1052704,2021-08-09,000001,Vente,180550,10,,RUE DU FLOT MARCQ,0034,62250,62329,Ferques,62,,,62329000AE0118,,,,,,,,,,,,,0,1,Maison,100,4,S,sols,,,371,1.761121,50.83428
2021-1052979,2021-08-27,000002,Vente,120000,,,ELINGHEM,B014,62250,62329,Ferques,62,,,62329000AC0049,,,,,,,,,,,,,0,,,,,P,prés,,,3091,1.777503,50.821738
2021-1052979,2021-08-27,000002,Vente,120000,2,,RUE FREDERIC SAUVAGE,0052,62250,62329,Ferques,62,,,62329000AC0253,,,,,,,,,,,,,0,1,Maison,96,2,S,sols,,,1412,1.777543,50.8222
2021-1052979,2021-08-27,000002,Vente,120000,,,ELINGHEM,B014,62250,62329,Ferques,62,,,62329000AC0257,,,,,,,,,,,,,0,,,,,S,sols,,,23,1.777791,50.822245
2021-1052979,2021-08-27,000002,Vente,120000,,,ELINGHEM,B014,62250,62329,Ferques,62,,,62329000AC0263,,,,,,,,,,,,,0,,,,,J,jardins,,,660,1.777058,50.821962
2021-1053122,2021-08-30,000001,Vente,194400,,,LA PETITE MARE,B033,62250,62329,Ferques,62,,,62329000AA0055,,,,,,,,,,,,,0,,,,,J,jardins,,,559,1.752946,50.83714
2021-1053122,2021-08-30,000001,Vente,194400,1,,RUE DES RAMONETTES,0063,62250,62329,Ferques,62,,,62329000AA0056,,,,,,,,,,,,,0,3,Dépendance,,0,S,sols,,,733,1.753792,50.836861
2021-1053122,2021-08-30,000001,Vente,194400,1,,RUE DES RAMONETTES,0063,62250,62329,Ferques,62,,,62329000AA0056,,,,,,,,,,,,,0,1,Maison,106,4,S,sols,,,733,1.753792,50.836861
2021-1053122,2021-08-30,000001,Vente,194400,1,,RUE DES RAMONETTES,0063,62250,62329,Ferques,62,,,62329000AA0056,,,,,,,,,,,,,0,3,Dépendance,,0,S,sols,,,733,1.753792,50.836861
2021-1053122,2021-08-30,000001,Vente,194400,1,,RUE DES RAMONETTES,0063,62250,62329,Ferques,62,,,62329000AA0056,,,,,,,,,,,,,0,3,Dépendance,,0,S,sols,,,733,1.753792,50.836861
2021-1053311,2021-09-10,000001,Vente,93700,13,,RUE DU PONT,0062,62250,62329,Ferques,62,,,62329000AK0094,,,,,,,,,,,,,0,1,Maison,130,4,S,sols,,,348,1.776799,50.817626
2021-1053407,2021-09-27,000001,Vente,218602,,,LE VILLAGE,B044,62250,62329,Ferques,62,,,62329000AH0086,,,,,,,,,,,,,0,,,,,S,sols,,,117,1.75774,50.831275
2021-1053407,2021-09-27,000001,Vente,218602,14,C,RUE LOUIS LE SENECHAL,0066,62250,62329,Ferques,62,,,62329000AH0090,,,,,,,,,,,,,0,1,Maison,131,6,S,sols,,,1037,1.758043,50.830955
2021-1053407,2021-09-27,000001,Vente,218602,,,LE VILLAGE,B044,62250,62329,Ferques,62,,,62329000AH0091,,,,,,,,,,,,,0,,,,,S,sols,,,126,1.757936,50.831131
2021-1053407,2021-09-27,000001,Vente,218602,,,LE VILLAGE,B044,62250,62329,Ferques,62,,,62329000AH0175,,,,,,,,,,,,,0,,,,,S,sols,,,25,1.757754,50.831251
2021-1053696,2021-10-07,000001,Vente,150000,5,,RUE DE LA MOTTE,0058,62250,62329,Ferques,62,,,62329000AE0068,,,,,,,,,,,,,0,3,Dépendance,,0,S,sols,,,874,1.760195,50.833604
2021-1053696,2021-10-07,000001,Vente,150000,5,,RUE DE LA MOTTE,0058,62250,62329,Ferques,62,,,62329000AE0068,,,,,,,,,,,,,0,1,Maison,78,3,S,sols,,,874,1.760195,50.833604
2021-1053701,2021-10-08,000001,Vente,5000,,,LE HURE,B025,62250,62329,Ferques,62,,,62329000AI0124,,,,,,,,,,,,,0,,,,,S,sols,,,122,1.782206,50.827043
2021-1053816,2021-10-15,000001,Vente,203320,26,C,RUE DU COLONEL,0031,62250,62329,Ferques,62,,,62329000AB0265,,,,,,,,,,,,,0,1,Maison,83,5,S,sols,,,900,1.760499,50.839316
2021-1053927,2021-10-21,000001,Vente,161000,14,,RUE DES CARRIERES,0017,62250,62329,Ferques,62,,,62329000AB0054,,,,,,,,,,,,,0,1,Maison,158,5,S,sols,,,184,1.76056,50.837317
2021-1053927,2021-10-21,000001,Vente,161000,,,LA FONTAINE DES NOCES,B022,62250,62329,Ferques,62,,,62329000AB0055,,,,,,,,,,,,,0,,,,,S,sols,,,621,1.760742,50.83756
2021-1053927,2021-10-21,000001,Vente,161000,,,LA FONTAINE DES NOCES,B022,62250,62329,Ferques,62,,,62329000AB0219,,,,,,,,,,,,,0,,,,,J,jardins,,,500,1.760608,50.837567
2021-1053927,2021-10-21,000001,Vente,161000,,,LA FONTAINE DES NOCES,B022,62250,62329,Ferques,62,,,62329000AB0219,,,,,,,,,,,,,0,,,,,S,sols,,,280,1.760608,50.837567
2021-1054483,2021-12-06,000001,Vente,135000,21,,RUE EMILE ZOLA,0050,62250,62329,Ferques,62,,,62329000AH0115,,,,,,,,,,,,,0,1,Maison,63,3,S,sols,,,160,1.760047,50.829551
2021-1054715,2021-12-03,000001,Vente,50000,,,ELINGHEM,B014,62250,62329,Ferques,62,,,62329000AC0254,,,,,,,,,,,,,0,,,,,AB,terrains a bâtir,,,58,1.777628,50.822135
2021-1054715,2021-12-03,000001,Vente,50000,,,ELINGHEM,B014,62250,62329,Ferques,62,,,62329000AC0256,,,,,,,,,,,,,0,,,,,AB,terrains a bâtir,,,681,1.77767,50.82209
2021-1054716,2021-12-06,000001,Vente,50000,,,ELINGHEM,B014,62250,62329,Ferques,62,,,62329000AC0255,,,,,,,,,,,,,0,,,,,AB,terrains a bâtir,,,769,1.777979,50.821988
2021-1054720,2021-12-06,000001,Vente,181000,3,,RUE DU COLONEL,0031,62250,62329,Ferques,62,,,62329000AB0049,,,,,,,,,,,,,0,1,Maison,101,3,S,sols,,,265,1.762119,50.838495
2021-1054720,2021-12-06,000001,Vente,181000,,,LA FONTAINE DES NOCES,B022,62250,62329,Ferques,62,,,62329000AB0050,,,,,,,,,,,,,0,,,,,J,jardins,,,1310,1.761853,50.838199
2021-1054720,2021-12-06,000001,Vente,181000,,,LA FONTAINE DES NOCES,B022,62250,62329,Ferques,62,,,62329000AB0172,,,,,,,,,,,,,0,,,,,AB,terrains a bâtir,,,1721,1.762105,50.838143
2021-1054733,2021-12-02,000001,Vente,228000,1,,RUE PASTEUR,0059,62250,62329,Ferques,62,,,62329000AK0026,,,,,,,,,,,,,0,1,Maison,140,4,S,sols,,,477,1.773375,50.817645
2021-1054926,2021-12-17,000001,Vente,32200,,,ELINGHEM,B014,62250,62329,Ferques,62,,,62329000AC0006,,,,,,,,,,,,,0,,,,,L,landes,,,482,1.77558,50.820859
2021-1054926,2021-12-17,000001,Vente,32200,,,LA FONTAINE DES NOCES,B022,62250,62329,Ferques,62,,,62329000AC0008,,,,,,,,,,,,,0,,,,,P,prés,,,13620,1.775601,50.82203
2021-1054926,2021-12-17,000001,Vente,32200,,,ELINGHEM,B014,62250,62329,Ferques,62,,,62329000AC0262,,,,,,,,,,,,,0,,,,,P,prés,,,8160,1.776198,50.821368
2021-1054926,2021-12-17,000001,Vente,32200,,,LE FOND DU HURE,B020,62250,62329,Ferques,62,,,623290000B0348,,,,,,,,,,,,,0,,,,,T,terres,,,5500,1.779045,50.826737
2021-1054926,2021-12-17,000001,Vente,32200,,,LE FOND DU HURE,B020,62250,62329,Ferques,62,,,623290000B0352,,,,,,,,,,,,,0,,,,,P,prés,,,6250,1.778885,50.828795
2021-1055037,2021-12-17,000001,Vente,170172,10,,RUE ANDRE PERET,0006,62250,62329,Ferques,62,,,62329000AE0101,,,,,,,,,,,,,0,1,Maison,85,4,P,prés,,,434,1.760497,50.834066
2021-1055218,2021-12-31,000001,Vente,155000,4,,RUE DE LA BASSE VILLE,0013,62250,62329,Ferques,62,,,62329000AK0068,,,,,,,,,,,,,0,1,Maison,208,6,S,sols,,,821,1.780077,50.820081
