id_mutation,date_mutation,numero_disposition,nature_mutation,valeur_fonciere,adresse_numero,adresse_suffixe,adresse_nom_voie,adresse_code_voie,code_postal,code_commune,nom_commune,code_departement,ancien_code_commune,ancien_nom_commune,id_parcelle,ancien_id_parcelle,numero_volume,lot1_numero,lot1_surface_carrez,lot2_numero,lot2_surface_carrez,lot3_numero,lot3_surface_carrez,lot4_numero,lot4_surface_carrez,lot5_numero,lot5_surface_carrez,nombre_lots,code_type_local,type_local,surface_reelle_bati,nombre_pieces_principales,code_nature_culture,nature_culture,code_nature_culture_speciale,nature_culture_speciale,surface_terrain,longitude,latitude
2021-1032380,2021-01-12,000001,Vente,225000,2,,RUE D ARRAS,0010,62810,62490,Lattre-Saint-Quentin,62,,,62490000ZE0006,,,,,,,,,,,,,0,1,Maison,151,6,S,sols,,,500,2.574271,50.292276
2021-1032380,2021-01-12,000001,Vente,225000,2,,RUE D ARRAS,0010,62810,62490,Lattre-Saint-Quentin,62,,,62490000ZE0006,,,,,,,,,,,,,0,1,Maison,151,6,P,prés,,,2310,2.574271,50.292276
2021-1032691,2021-01-13,000001,Vente,176700,2,,CHE DU GY,0052,62810,62490,Lattre-Saint-Quentin,62,,,62490000AB0010,,,,,,,,,,,,,0,1,Maison,108,4,S,sols,,,970,2.577069,50.290514
2021-1032691,2021-01-13,000001,Vente,176700,2,,CHE DU GY,0052,62810,62490,Lattre-Saint-Quentin,62,,,62490000AB0010,,,,,,,,,,,,,0,1,Maison,108,4,AG,terrains d'agrément,,,2096,2.577069,50.290514
2021-1034213,2021-04-08,000001,Vente,100000,,,SENTIER DE BARLY,B013,62810,62490,Lattre-Saint-Quentin,62,,,62490000ZK0064,,,,,,,,,,,,,0,,,,,AB,terrains a bâtir,,,2007,2.578484,50.285148
2021-1034213,2021-04-08,000001,Vente,100000,,,SENTIER DE BARLY,B013,62810,62490,Lattre-Saint-Quentin,62,,,62490000ZK0065,,,,,,,,,,,,,0,,,,,AB,terrains a bâtir,,,28,2.578784,50.284825
2021-1034213,2021-04-08,000001,Vente,100000,,,SENTIER DE BARLY,B013,62810,62490,Lattre-Saint-Quentin,62,,,62490000ZK0066,,,,,,,,,,,,,0,,,,,AB,terrains a bâtir,,,2008,2.578164,50.284947
2021-1034213,2021-04-08,000001,Vente,100000,,,SENTIER DE BARLY,B013,62810,62490,Lattre-Saint-Quentin,62,,,62490000ZK0067,,,,,,,,,,,,,0,,,,,AB,terrains a bâtir,,,25,2.57852,50.284652
2021-1035089,2021-05-31,000001,Vente,74300,,,LE VILLAGE SUD,B018,62810,62490,Lattre-Saint-Quentin,62,,,62490000AA0159,,,,,,,,,,,,,0,,,,,P,prés,,,1459,2.582063,50.285482
2021-1035467,2021-06-21,000001,Vente,152500,,,LE VILLAGE SUD,B018,62810,62490,Lattre-Saint-Quentin,62,,,62490000AA0009,,,,,,,,,,,,,0,,,,,P,prés,,,7444,2.581747,50.287885
2021-1036219,2021-07-26,000002,Vente,19780,,,SENTIER DE BARLY,B013,62810,62490,Lattre-Saint-Quentin,62,,,62490000ZK0070,,,,,,,,,,,,,0,,,,,T,terres,,,1978,2.578878,50.285582
2021-1036482,2021-08-17,000001,Vente,268000,20,,GR GRAND RUE,0050,62810,62490,Lattre-Saint-Quentin,62,,,62490000AA0072,,,,,,,,,,,,,0,1,Maison,96,4,AG,terrains d'agrément,,,1380,2.580091,50.287457
2021-1036482,2021-08-17,000001,Vente,268000,20,,GR GRAND RUE,0050,62810,62490,Lattre-Saint-Quentin,62,,,62490000AA0072,,,,,,,,,,,,,0,1,Maison,96,4,S,sols,,,628,2.580091,50.287457
2021-1037030,2021-09-22,000001,Vente,340000,6,,GR GRAND RUE,0050,62810,62490,Lattre-Saint-Quentin,62,,,62490000AA0081,,,,,,,,,,,,,0,1,Maison,230,5,AG,terrains d'agrément,,,2066,2.578664,50.288586
2021-1037030,2021-09-22,000001,Vente,340000,6,,GR GRAND RUE,0050,62810,62490,Lattre-Saint-Quentin,62,,,62490000AA0081,,,,,,,,,,,,,0,3,Dépendance,,0,S,sols,,,961,2.578664,50.288586
2021-1037030,2021-09-22,000001,Vente,340000,6,,GR GRAND RUE,0050,62810,62490,Lattre-Saint-Quentin,62,,,62490000AA0081,,,,,,,,,,,,,0,3,Dépendance,,0,AG,terrains d'agrément,,,2066,2.578664,50.288586
2021-1037030,2021-09-22,000001,Vente,340000,6,,GR GRAND RUE,0050,62810,62490,Lattre-Saint-Quentin,62,,,62490000AA0081,,,,,,,,,,,,,0,1,Maison,230,5,S,sols,,,961,2.578664,50.288586
2021-1037637,2021-10-01,000001,Vente,48000,,,LE VILLAGE NORD,B019,62810,62490,Lattre-Saint-Quentin,62,,,62490000AB0124,,,,,,,,,,,,,0,,,,,P,prés,,,1666,2.578605,50.291083
2021-1038444,2021-08-23,000001,Vente,35000,,,LE VILLAGE NORD,B019,62810,62490,Lattre-Saint-Quentin,62,,,62490000AB0009,,,,,,,,,,,,,0,,,,,P,prés,,,2494,2.576533,50.290508
2021-1038444,2021-08-23,000001,Vente,35000,,,LA COUTURE,B004,62810,62490,Lattre-Saint-Quentin,62,,,62490000ZK0010,,,,,,,,,,,,,0,,,,,T,terres,,,370,2.575997,50.290189
2021-1038907,2021-12-07,000001,Vente,17000,,,LE PRE POTIN,B012,62810,62490,Lattre-Saint-Quentin,62,,,62490000ZE0036,,,,,,,,,,,,,0,,,,,T,terres,,,6200,2.582602,50.29304
