id_mutation,date_mutation,numero_disposition,nature_mutation,valeur_fonciere,adresse_numero,adresse_suffixe,adresse_nom_voie,adresse_code_voie,code_postal,code_commune,nom_commune,code_departement,ancien_code_commune,ancien_nom_commune,id_parcelle,ancien_id_parcelle,numero_volume,lot1_numero,lot1_surface_carrez,lot2_numero,lot2_surface_carrez,lot3_numero,lot3_surface_carrez,lot4_numero,lot4_surface_carrez,lot5_numero,lot5_surface_carrez,nombre_lots,code_type_local,type_local,surface_reelle_bati,nombre_pieces_principales,code_nature_culture,nature_culture,code_nature_culture_speciale,nature_culture_speciale,surface_terrain,longitude,latitude
2021-1032643,2021-01-27,000001,Vente,177000,12,,RUE LEBLEU LEGENTIL,0080,62860,62671,Pronville-en-Artois,62,,,626710000A0428,,,,,,,,,,,,,0,1,Maison,100,5,S,sols,,,995,3.003746,50.176666
2021-1032643,2021-01-27,000001,Vente,177000,,,LE VILLAGE,B035,62860,62671,Pronville-en-Artois,62,,,626710000A0435,,,,,,,,,,,,,0,,,,,J,jardins,,,595,3.00387,50.176713
2021-1032643,2021-01-27,000001,Vente,177000,,,LE VILLAGE,B035,62860,62671,Pronville-en-Artois,62,,,626710000A0436,,,,,,,,,,,,,0,,,,,J,jardins,,,130,3.004044,50.176484
2021-1032861,2021-01-28,000001,Vente,25000,5,,RLE TRAVERSIERE,0160,62860,62671,Pronville-en-Artois,62,,,626710000A0552,,,,,,,,,,,,,0,1,Maison,56,2,S,sols,,,338,3.004005,50.173621
2021-1032861,2021-01-28,000001,Vente,25000,,,LE VILLAGE,B035,62860,62671,Pronville-en-Artois,62,,,626710000A0690,,,,,,,,,,,,,0,,,,,S,sols,,,99,3.003889,50.173648
2021-1034478,2021-05-05,000001,Vente,152000,1,B,RUE DU PONT,0100,62860,62671,Pronville-en-Artois,62,,,626710000A0929,,,,,,,,,,,,,0,1,Maison,116,4,S,sols,,,356,3.001598,50.175071
2021-1035916,2021-07-24,000001,Vente,90000,13,,RUE DE QUEANT,0120,62860,62671,Pronville-en-Artois,62,,,626710000A0452,,,,,,,,,,,,,0,1,Maison,113,5,S,sols,,,540,3.001888,50.176353
2021-1035916,2021-07-24,000001,Vente,90000,13,,RUE DE QUEANT,0120,62860,62671,Pronville-en-Artois,62,,,626710000A0452,,,,,,,,,,,,,0,3,Dépendance,,0,S,sols,,,540,3.001888,50.176353
2021-1036048,2021-07-23,000001,Vente,70000,15,,RUE DE QUEANT,0120,62860,62671,Pronville-en-Artois,62,,,626710000A0451,,,,,,,,,,,,,0,3,Dépendance,,0,S,sols,,,522,3.002055,50.176247
2021-1036048,2021-07-23,000001,Vente,70000,15,,RUE DE QUEANT,0120,62860,62671,Pronville-en-Artois,62,,,626710000A0451,,,,,,,,,,,,,0,1,Maison,88,3,S,sols,,,522,3.002055,50.176247
2021-1038104,2021-11-03,000001,Vente,1185,,,LE HAMEAU DU BOUT DU SAC,B022,62860,62671,Pronville-en-Artois,62,,,626710000B0277,,,,,,,,,,,,,0,,,,,J,jardins,,,255,3.000247,50.171883
2021-1038104,2021-11-03,000001,Vente,1185,,,LE CALVAIRE,B004,62860,62671,Pronville-en-Artois,62,,,62671000ZI0017,,,,,,,,,,,,,0,,,,,T,terres,,,1900,3.007646,50.173202
