id_mutation,date_mutation,numero_disposition,nature_mutation,valeur_fonciere,adresse_numero,adresse_suffixe,adresse_nom_voie,adresse_code_voie,code_postal,code_commune,nom_commune,code_departement,ancien_code_commune,ancien_nom_commune,id_parcelle,ancien_id_parcelle,numero_volume,lot1_numero,lot1_surface_carrez,lot2_numero,lot2_surface_carrez,lot3_numero,lot3_surface_carrez,lot4_numero,lot4_surface_carrez,lot5_numero,lot5_surface_carrez,nombre_lots,code_type_local,type_local,surface_reelle_bati,nombre_pieces_principales,code_nature_culture,nature_culture,code_nature_culture_speciale,nature_culture_speciale,surface_terrain,longitude,latitude
2021-1056470,2021-05-07,000002,Vente,1,,,LE VILLAGE,B028,62140,62824,Tortefontaine,62,,,628240000B0459,,,,,,,,,,,,,0,,,,,T,terres,,,160,1.92515,50.323543
2021-1056476,2021-05-07,000001,Vente,93000,,,LE VILLAGE,B028,62140,62824,Tortefontaine,62,,,628240000B0123,,,,,,,,,,,,,0,,,,,J,jardins,,,601,1.925033,50.323438
2021-1056476,2021-05-07,000001,Vente,93000,15,,RUE DU QUINT,0126,62140,62824,Tortefontaine,62,,,628240000B0124,,,,,,,,,,,,,0,1,Maison,96,4,S,sols,,,429,1.925184,50.323391
2021-1056476,2021-05-07,000001,Vente,93000,,,LE VILLAGE,B028,62140,62824,Tortefontaine,62,,,628240000B0459,,,,,,,,,,,,,0,,,,,T,terres,,,160,1.92515,50.323543
2021-1057210,2021-07-05,000001,Vente,133000,,,LE VILLAGE,B028,62140,62824,Tortefontaine,62,,,628240000B0293,,,,,,,,,,,,,0,,,,,P,prés,,,1446,1.922686,50.321223
2021-1057210,2021-07-05,000001,Vente,133000,4,,RUE DU QUINT,0126,62140,62824,Tortefontaine,62,,,628240000B0326,,,,,,,,,,,,,0,3,Dépendance,,0,P,prés,,,437,1.922348,50.321539
2021-1057210,2021-07-05,000001,Vente,133000,4,,RUE DU QUINT,0126,62140,62824,Tortefontaine,62,,,628240000B0326,,,,,,,,,,,,,0,1,Maison,115,4,P,prés,,,437,1.922348,50.321539
2021-1057210,2021-07-05,000001,Vente,133000,4,,RUE DU QUINT,0126,62140,62824,Tortefontaine,62,,,628240000B0326,,,,,,,,,,,,,0,3,Dépendance,,0,S,sols,,,468,1.922348,50.321539
2021-1057210,2021-07-05,000001,Vente,133000,4,,RUE DU QUINT,0126,62140,62824,Tortefontaine,62,,,628240000B0326,,,,,,,,,,,,,0,1,Maison,115,4,S,sols,,,468,1.922348,50.321539
2021-1057481,2021-07-01,000001,Vente,29000,,,LE VILLAGE,B028,62140,62824,Tortefontaine,62,,,628240000B0447,,,,,,,,,,,,,0,,,,,J,jardins,,,813,1.921743,50.319657
2021-1057481,2021-07-01,000001,Vente,29000,,,LE VILLAGE,B028,62140,62824,Tortefontaine,62,,,628240000B0447,,,,,,,,,,,,,0,,,,,P,prés,,,2534,1.921743,50.319657
2021-1057915,2021-08-30,000001,Vente,149000,8,,HAMEAU DE SAINT JOSSE,B015,62140,62824,Tortefontaine,62,,,628240000E0179,,,,,,,,,,,,,0,1,Maison,150,6,S,sols,,,2315,1.899262,50.347899
2021-1057915,2021-08-30,000001,Vente,149000,8,,HAMEAU DE SAINT JOSSE,B015,62140,62824,Tortefontaine,62,,,628240000E0179,,,,,,,,,,,,,0,1,Maison,150,6,P,prés,,,1100,1.899262,50.347899
2021-1058016,2021-09-08,000001,Vente,10000,,,HAMEAU DE SAINT JOSSE,B015,62140,62824,Tortefontaine,62,,,628240000E0036,,,,,,,,,,,,,0,,,,,T,terres,,,2382,1.89723,50.347814
2021-1058105,2021-09-10,000001,Vente,500,,,LE MARAIS,B020,62140,62824,Tortefontaine,62,,,628240000C0206,,,,,,,,,,,,,0,,,,,J,jardins,,,118,1.898477,50.315724
2021-1059357,2021-12-15,000001,Vente,110000,10,,RUE DU QUINT,0126,62140,62824,Tortefontaine,62,,,628240000B0109,,,,,,,,,,,,,0,3,Dépendance,,0,S,sols,,,910,1.923333,50.321996
2021-1059357,2021-12-15,000001,Vente,110000,10,,RUE DU QUINT,0126,62140,62824,Tortefontaine,62,,,628240000B0109,,,,,,,,,,,,,0,1,Maison,130,4,S,sols,,,910,1.923333,50.321996
2021-1059357,2021-12-15,000001,Vente,110000,,,LE VILLAGE,B028,62140,62824,Tortefontaine,62,,,628240000B0110,,,,,,,,,,,,,0,,,,,J,jardins,,,1660,1.92352,50.321761
