id_mutation,date_mutation,numero_disposition,nature_mutation,valeur_fonciere,adresse_numero,adresse_suffixe,adresse_nom_voie,adresse_code_voie,code_postal,code_commune,nom_commune,code_departement,ancien_code_commune,ancien_nom_commune,id_parcelle,ancien_id_parcelle,numero_volume,lot1_numero,lot1_surface_carrez,lot2_numero,lot2_surface_carrez,lot3_numero,lot3_surface_carrez,lot4_numero,lot4_surface_carrez,lot5_numero,lot5_surface_carrez,nombre_lots,code_type_local,type_local,surface_reelle_bati,nombre_pieces_principales,code_nature_culture,nature_culture,code_nature_culture_speciale,nature_culture_speciale,surface_terrain,longitude,latitude
2021-1067527,2021-06-04,000001,Vente,2000,,,LE VIEUX MARAIS,B206,63620,63064,La Celle,63,,,63064000AC0255,,,,,,,,,,,,,0,,,,,BR,futaies résineuses,,,3635,2.474474,45.859243
2021-1067527,2021-06-04,000001,Vente,2000,,,LE VIEUX MARAIS,B206,63620,63064,La Celle,63,,,63064000AC0255,,,,,,,,,,,,,0,,,,,B,bois,,,3635,2.474474,45.859243
2021-1067527,2021-06-04,000001,Vente,2000,,,LE VIEUX MARAIS,B206,63620,63064,La Celle,63,,,63064000AC0256,,,,,,,,,,,,,0,,,,,BR,futaies résineuses,,,3730,2.475659,45.858943
2021-1067527,2021-06-04,000001,Vente,2000,,,LE VIEUX MARAIS,B206,63620,63064,La Celle,63,,,63064000AC0256,,,,,,,,,,,,,0,,,,,B,bois,,,3730,2.475659,45.858943
2021-1067527,2021-06-04,000001,Vente,2000,,,LE VIEUX MARAIS,B206,63620,63064,La Celle,63,,,63064000AC0258,,,,,,,,,,,,,0,,,,,BR,futaies résineuses,,,505,2.475523,45.859341
2021-1067527,2021-06-04,000001,Vente,2000,,,LE VIEUX MARAIS,B206,63620,63064,La Celle,63,,,63064000AC0258,,,,,,,,,,,,,0,,,,,B,bois,,,505,2.475523,45.859341
2021-1068288,2021-06-25,000001,Vente,3000,,,LA CORADE,B058,63620,63064,La Celle,63,,,63064000AB0139,,,,,,,,,,,,,0,,,,,BR,futaies résineuses,,,15220,2.456198,45.863278
2021-1068529,2021-06-17,000002,Vente,116000,,,LA REGEASSE,B168,63620,63064,La Celle,63,,,63064000AK0045,,,,,,,,,,,,,0,,,,,S,sols,,,680,2.502121,45.840261
2021-1068529,2021-06-17,000002,Vente,116000,,,LA REGEASSE,B168,63620,63064,La Celle,63,,,63064000AK0046,,,,,,,,,,,,,0,,,,,S,sols,,,307,2.501892,45.840214
2021-1068529,2021-06-17,000002,Vente,116000,5081,,LA REGEASSE,B168,63620,63064,La Celle,63,,,63064000AK0057,,,,,,,,,,,,,0,1,Maison,115,5,S,sols,,,666,2.501786,45.839925
2021-1068529,2021-06-17,000002,Vente,116000,5081,,LA REGEASSE,B168,63620,63064,La Celle,63,,,63064000AK0057,,,,,,,,,,,,,0,3,Dépendance,,0,S,sols,,,666,2.501786,45.839925
2021-1068529,2021-06-17,000002,Vente,116000,,,LA REGEASSE,B168,63620,63064,La Celle,63,,,63064000AK0059,,,,,,,,,,,,,0,,,,,S,sols,,,41,2.5021,45.83986
2021-1068529,2021-06-17,000002,Vente,116000,,,LES SEUS,B186,63620,63064,La Celle,63,,,63064000AK0131,,,,,,,,,,,,,0,,,,,P,prés,,,957,2.502061,45.840485
2021-1071199,2021-07-21,000001,Vente,15000,5004,,LE BOURG,B026,63620,63064,La Celle,63,,,63064000AH0017,,,,,,,,,,,,,0,1,Maison,71,2,S,sols,,,432,2.475965,45.853865
2021-1071199,2021-07-21,000001,Vente,15000,,,LE BOURG,B026,63620,63064,La Celle,63,,,63064000AH0018,,,,,,,,,,,,,0,,,,,T,terres,,,729,2.475742,45.853928
2021-1073453,2021-09-20,000001,Vente,10000,,,SAGNE LEGRAND PRES DE L ET,B180,63620,63064,La Celle,63,,,63064000AB0026,,,,,,,,,,,,,0,,,,,T,terres,,,5740,2.450561,45.861346
2021-1073453,2021-09-20,000001,Vente,10000,,,LES SERPENTINES,B187,63620,63064,La Celle,63,,,63064000AB0069,,,,,,,,,,,,,0,,,,,BT,taillis simples,,,3175,2.463537,45.865109
2021-1073453,2021-09-20,000001,Vente,10000,,,LA CHABROLLE,B030,63620,63064,La Celle,63,,,63064000AB0212,,,,,,,,,,,,,0,,,,,BR,futaies résineuses,,,7120,2.443948,45.859935
2021-1074266,2021-10-01,000001,Vente,4200,,,PUY RICHIN,B162,63620,63064,La Celle,63,,,63064000AK0018,,,,,,,,,,,,,0,,,,,PA,pâtures,,,22040,2.504563,45.844477
2021-1074266,2021-10-01,000001,Vente,4200,,,PUY RICHIN,B162,63620,63064,La Celle,63,,,63064000AK0019,,,,,,,,,,,,,0,,,,,T,terres,,,4290,2.505213,45.845328
2021-1076301,2021-10-28,000001,Vente,177000,,,SAUGERE,B184,63620,63064,La Celle,63,,,63064000AB0168,,,,,,,,,,,,,0,,,,,J,jardins,,,339,2.451617,45.858054
2021-1076301,2021-10-28,000001,Vente,177000,5047,,SAUGERE,B184,63620,63064,La Celle,63,,,63064000AB0169,,,,,,,,,,,,,0,3,Dépendance,,0,S,sols,,,685,2.451447,45.857938
2021-1076301,2021-10-28,000001,Vente,177000,5047,,SAUGERE,B184,63620,63064,La Celle,63,,,63064000AB0169,,,,,,,,,,,,,0,1,Maison,125,3,S,sols,,,685,2.451447,45.857938
2021-1076301,2021-10-28,000001,Vente,177000,,,PRE GIRAUD,B145,63620,63064,La Celle,63,,,63064000AP0023,,,,,,,,,,,,,0,,,,,T,terres,,,4110,2.451362,45.857456
2021-1077470,2021-11-19,000001,Vente,57500,,,LA REGEASSE,B168,63620,63064,La Celle,63,,,63064000AK0043,,,,,,,,,,,,,0,,,,,J,jardins,,,178,2.502045,45.840044
2021-1077470,2021-11-19,000001,Vente,57500,5084,,LA REGEASSE,B168,63620,63064,La Celle,63,,,63064000AK0052,,,,,,,,,,,,,0,1,Maison,110,3,S,sols,,,449,2.501241,45.84031
2021-1077470,2021-11-19,000001,Vente,57500,,,LA REGEASSE,B168,63620,63064,La Celle,63,,,63064000AK0053,,,,,,,,,,,,,0,,,,,S,sols,,,325,2.500996,45.840206
2021-1077470,2021-11-19,000001,Vente,57500,,,LA REGEASSE,B168,63620,63064,La Celle,63,,,63064000AK0067,,,,,,,,,,,,,0,,,,,P,prés,,,3400,2.500728,45.840112
2021-1077470,2021-11-19,000001,Vente,57500,,,LA REGEASSE,B168,63620,63064,La Celle,63,,,63064000AK0067,,,,,,,,,,,,,0,,,,,S,sols,,,60,2.500728,45.840112
2021-1080109,2021-02-03,000001,Vente,55000,5097,,PARSANGES,B117,63620,63064,La Celle,63,,,63064000AE0236,,,,,,,,,,,,,0,1,Maison,82,4,S,sols,,,500,2.482927,45.850224
2021-1080109,2021-02-03,000001,Vente,55000,5097,,PARSANGES,B117,63620,63064,La Celle,63,,,63064000AE0236,,,,,,,,,,,,,0,1,Maison,82,4,P,prés,,,12920,2.482927,45.850224
2021-1080165,2021-02-02,000001,Vente,38000,,,SAUGERE,B184,63620,63064,La Celle,63,,,63064000AB0157,,,,,,,,,,,,,0,,,,,J,jardins,,,722,2.452034,45.859127
2021-1080165,2021-02-02,000001,Vente,38000,5042,,SAUGERE,B184,63620,63064,La Celle,63,,,63064000AB0158,,,,,,,,,,,,,0,1,Maison,121,3,S,sols,,,170,2.452058,45.85931
2021-1080165,2021-02-02,000001,Vente,38000,,,SAUGERE,B184,63620,63064,La Celle,63,,,63064000AB0159,,,,,,,,,,,,,0,,,,,L,landes,,,1195,2.451582,45.859182
2021-1080165,2021-02-02,000001,Vente,38000,,,SAUGERE,B184,63620,63064,La Celle,63,,,63064000AB0230,,,,,,,,,,,,,0,,,,,S,sols,,,400,2.452004,45.859258
2021-1080165,2021-02-02,000001,Vente,38000,,,PRE LE PIC,B146,63620,63064,La Celle,63,,,63064000AP0008,,,,,,,,,,,,,0,,,,,P,prés,,,852,2.449311,45.857592
2021-1080165,2021-02-02,000001,Vente,38000,,,PRE LE PIC,B146,63620,63064,La Celle,63,,,63064000AP0009,,,,,,,,,,,,,0,,,,,P,prés,,,1575,2.44908,45.857918
2021-1080699,2021-04-08,000001,Vente,13700,,,LA NAUTE D EN HAUT,B113,63620,63064,La Celle,63,,,63064000AC0029,,,,,,,,,,,,,0,,,,,BR,futaies résineuses,,,8100,2.472378,45.862427
2021-1080699,2021-04-08,000001,Vente,13700,,,LA NAUTE D EN HAUT,B113,63620,63064,La Celle,63,,,63064000AC0034,,,,,,,,,,,,,0,,,,,BR,futaies résineuses,,,5520,2.469264,45.864235
2021-1080699,2021-04-08,000001,Vente,13700,,,LA NAUTE D EN HAUT,B113,63620,63064,La Celle,63,,,63064000AC0034,,,,,,,,,,,,,0,,,,,BT,taillis simples,,,5520,2.469264,45.864235
2021-1080699,2021-04-08,000001,Vente,13700,,,LES COURTEIX,B067,63620,63064,La Celle,63,,,63064000AC0040,,,,,,,,,,,,,0,,,,,PA,pâtures,,,14650,2.46707,45.865669
2021-1080699,2021-04-08,000001,Vente,13700,,,VEYCHARD,B204,63620,63064,La Celle,63,,,63064000AC0067,,,,,,,,,,,,,0,,,,,L,landes,,,42,2.467649,45.869252
2021-1080699,2021-04-08,000001,Vente,13700,,,LES MEILLETS,B103,63620,63064,La Celle,63,,,63064000AC0150,,,,,,,,,,,,,0,,,,,BT,taillis simples,,,1925,2.478233,45.869396
2021-1080699,2021-04-08,000001,Vente,13700,,,ENTRE DEUX VAUX,B075,63620,63064,La Celle,63,,,63064000AC0161,,,,,,,,,,,,,0,,,,,PA,pâtures,,,1830,2.478516,45.865261
2021-1080699,2021-04-08,000001,Vente,13700,,,ENTRE DEUX VAUX,B075,63620,63064,La Celle,63,,,63064000AC0162,,,,,,,,,,,,,0,,,,,PA,pâtures,,,2110,2.478789,45.864881
2021-1080699,2021-04-08,000001,Vente,13700,,,ENTRE DEUX VAUX,B075,63620,63064,La Celle,63,,,63064000AC0163,,,,,,,,,,,,,0,,,,,L,landes,,,246,2.479171,45.864626
2021-1080699,2021-04-08,000001,Vente,13700,,,ENTRE DEUX VAUX,B075,63620,63064,La Celle,63,,,63064000AC0164,,,,,,,,,,,,,0,,,,,BT,taillis simples,,,1230,2.478517,45.864765
2021-1080699,2021-04-08,000001,Vente,13700,,,ENTRE DEUX VAUX,B075,63620,63064,La Celle,63,,,63064000AC0165,,,,,,,,,,,,,0,,,,,BT,taillis simples,,,871,2.478151,45.865223
2021-1080699,2021-04-08,000001,Vente,13700,,,LES PIOLETS,B136,63620,63064,La Celle,63,,,63064000AC0168,,,,,,,,,,,,,0,,,,,BT,taillis simples,,,1500,2.477044,45.866171
2021-1080699,2021-04-08,000001,Vente,13700,,,LES PIOLETS,B136,63620,63064,La Celle,63,,,63064000AC0169,,,,,,,,,,,,,0,,,,,PA,pâtures,,,8375,2.47731,45.866827
2021-1080699,2021-04-08,000001,Vente,13700,,,LES CHADIERES,B032,63620,63064,La Celle,63,,,63064000AC0200,,,,,,,,,,,,,0,,,,,BR,futaies résineuses,,,9480,2.471449,45.865145
2021-1080699,2021-04-08,000001,Vente,13700,,,LES CHADIERES,B032,63620,63064,La Celle,63,,,63064000AC0227,,,,,,,,,,,,,0,,,,,BT,taillis simples,,,4515,2.477455,45.86562
2021-1080699,2021-04-08,000001,Vente,13700,,,LE VIEUX MARAIS,B206,63620,63064,La Celle,63,,,63064000AC0250,,,,,,,,,,,,,0,,,,,BT,taillis simples,,,7960,2.473105,45.859998
