id_mutation,date_mutation,numero_disposition,nature_mutation,valeur_fonciere,adresse_numero,adresse_suffixe,adresse_nom_voie,adresse_code_voie,code_postal,code_commune,nom_commune,code_departement,ancien_code_commune,ancien_nom_commune,id_parcelle,ancien_id_parcelle,numero_volume,lot1_numero,lot1_surface_carrez,lot2_numero,lot2_surface_carrez,lot3_numero,lot3_surface_carrez,lot4_numero,lot4_surface_carrez,lot5_numero,lot5_surface_carrez,nombre_lots,code_type_local,type_local,surface_reelle_bati,nombre_pieces_principales,code_nature_culture,nature_culture,code_nature_culture_speciale,nature_culture_speciale,surface_terrain,longitude,latitude
2021-1063670,2021-02-08,000001,Vente,181800,2,,RUE DE LA CROIX SAINT VERNY,0014,63160,63096,Chas,63,,,63096000ZA0067,,,,,,,,,,,,,0,1,Maison,88,4,S,sols,,,400,3.300379,45.750626
2021-1064698,2021-03-12,000001,Vente,80000,,,BOURG DE CHAS,B010,63160,63096,Chas,63,,,630960000B0041,,,,,,,,,,,,,0,,,,,S,sols,,,92,3.300812,45.749445
2021-1064698,2021-03-12,000001,Vente,80000,3,,RUE DE LA JONCHERE,0022,63160,63096,Chas,63,,,630960000B1098,,,,,,,,,,,,,0,1,Maison,65,3,S,sols,,,55,3.300784,45.749501
2021-1069843,2021-07-02,000001,Vente,218700,17,,RUE DE LA PETITE FONTAINE,0035,63160,63096,Chas,63,,,630960000B1550,,,,,,,,,,,,,0,1,Maison,74,4,S,sols,,,248,3.300567,45.750342
2021-1069843,2021-07-02,000001,Vente,218700,,,BOURG DE CHAS,B010,63160,63096,Chas,63,,,630960000B1552,,,,,,,,,,,,,0,,,,,S,sols,,,23,3.300485,45.750336
2021-1069843,2021-07-02,000001,Vente,218700,,,BOURG DE CHAS,B010,63160,63096,Chas,63,,,63096000ZA0309,,,,,,,,,,,,,0,,,,,S,sols,,,120,3.300442,45.750296
2021-1070791,2021-07-16,000001,Vente,219200,14,,RUE DES FICHAUX,0016,63160,63096,Chas,63,,,630960000B0273,,,,,,,,,,,,,0,1,Maison,136,6,S,sols,,,145,3.302177,45.74761
2021-1070791,2021-07-16,000001,Vente,219200,,,BOURG DE CHAS,B010,63160,63096,Chas,63,,,630960000B0275,,,,,,,,,,,,,0,,,,,J,jardins,,,170,3.302106,45.747687
2021-1071795,2021-08-27,000001,Vente,225100,,,BOURG DE CHAS,B010,63160,63096,Chas,63,,,630960000B0331,,,,,,,,,,,,,0,,,,,S,sols,,,55,3.302714,45.748326
2021-1071795,2021-08-27,000001,Vente,225100,3,,RUE DU CHATEAU,0008,63160,63096,Chas,63,,,630960000B0332,,,,,,,,,,,,,0,3,Dépendance,,0,S,sols,,,45,3.302723,45.748269
2021-1071795,2021-08-27,000001,Vente,225100,3,,RUE DU CHATEAU,0008,63160,63096,Chas,63,,,630960000B0332,,,,,,,,,,,,,0,1,Maison,154,5,S,sols,,,45,3.302723,45.748269
2021-1071795,2021-08-27,000001,Vente,225100,,,BOURG DE CHAS,B010,63160,63096,Chas,63,,,630960000B0342,,,,,,,,,,,,,0,,,,,S,sols,,,120,3.302934,45.748303
2021-1072424,2021-09-02,000001,Vente,2000,,,LA ROUBINE,B041,63160,63096,Chas,63,,,630960000B0382,,,,,,,,,,,,,0,,,,,T,terres,,,808,,
2021-1079628,2021-05-21,000001,Vente,42000,4,,RUE DU CHATEAU,0008,63160,63096,Chas,63,,,630960000B0338,,,,,,,,,,,,,0,1,Maison,110,3,S,sols,,,115,3.302961,45.748003
