id_mutation,date_mutation,numero_disposition,nature_mutation,valeur_fonciere,adresse_numero,adresse_suffixe,adresse_nom_voie,adresse_code_voie,code_postal,code_commune,nom_commune,code_departement,ancien_code_commune,ancien_nom_commune,id_parcelle,ancien_id_parcelle,numero_volume,lot1_numero,lot1_surface_carrez,lot2_numero,lot2_surface_carrez,lot3_numero,lot3_surface_carrez,lot4_numero,lot4_surface_carrez,lot5_numero,lot5_surface_carrez,nombre_lots,code_type_local,type_local,surface_reelle_bati,nombre_pieces_principales,code_nature_culture,nature_culture,code_nature_culture_speciale,nature_culture_speciale,surface_terrain,longitude,latitude
2021-1066243,2021-05-07,000001,Vente,250,,,LES COTES,B050,63490,63119,Condat-lès-Montboissier,63,,,63119000ZM0150,,,,,,,,,,,,,0,,,,,BR,futaies résineuses,,,2385,3.480754,45.542768
2021-1066243,2021-05-07,000001,Vente,250,,,LES COTES,B050,63490,63119,Condat-lès-Montboissier,63,,,63119000ZM0155,,,,,,,,,,,,,0,,,,,BR,futaies résineuses,,,1431,3.481318,45.542075
2021-1066243,2021-05-07,000001,Vente,250,,,LES COTES,B050,63490,63119,Condat-lès-Montboissier,63,,,63119000ZM0156,,,,,,,,,,,,,0,,,,,BT,taillis simples,,,1622,3.480793,45.542072
2021-1067929,2021-06-03,000002,Vente,50,,,LE BOURG,B153,63490,63119,Condat-lès-Montboissier,63,,,63119000ZL0280,,,,,,,,,,,,,0,,,,,S,sols,,,3,3.498302,45.550784
2021-1068296,2021-06-11,000001,Vente,91000,,,GRAND CHAMP,B076,63490,63119,Condat-lès-Montboissier,63,,,63119000ZS0210,,,,,,,,,,,,,0,,,,,P,prés,,,836,3.454661,45.546336
2021-1068296,2021-06-11,000001,Vente,91000,3,,RUE DES TOURTERELLES,0011,63490,63119,Condat-lès-Montboissier,63,,,63119000ZT0151,,,,,,,,,,,,,0,1,Maison,45,1,S,sols,,,235,3.454467,45.546094
2021-1070182,2021-07-20,000001,Vente,101000,2,,RUE DES ROSES,0015,63490,63119,Condat-lès-Montboissier,63,,,63119000ZK0063,,,,,,,,,,,,,0,,,,,PA,pâtures,,,2870,3.501605,45.561637
2021-1070182,2021-07-20,000001,Vente,101000,4,,RUE DES ROSES,0015,63490,63119,Condat-lès-Montboissier,63,,,63119000ZK0064,,,,,,,,,,,,,0,1,Maison,69,4,S,sols,,,890,3.501736,45.561759
2021-1071268,2021-07-29,000001,Vente,70000,10,,RUE DES MESANGES,0008,63490,63119,Condat-lès-Montboissier,63,,,63119000ZL0283,,,,,,,,,,,,,0,1,Maison,74,3,S,sols,,,352,3.49799,45.549965
2021-1072545,2021-09-09,000001,Vente,63305,1,,LE MAS,B094,63490,63119,Condat-lès-Montboissier,63,,,63119000ZO0183,,,,,,,,,,,,,0,1,Maison,80,3,S,sols,,,1120,3.482558,45.555384
2021-1072545,2021-09-09,000001,Vente,63305,1,,LE MAS,B094,63490,63119,Condat-lès-Montboissier,63,,,63119000ZO0183,,,,,,,,,,,,,0,1,Maison,80,3,PA,pâtures,,,7060,3.482558,45.555384
2021-1074257,2021-10-08,000001,Vente,1100,,,LA GOUTTE,B074,63490,63119,Condat-lès-Montboissier,63,,,63119000ZH0036,,,,,,,,,,,,,0,,,,,B,bois,,,1270,3.493949,45.57158
2021-1074257,2021-10-08,000001,Vente,1100,,,LE PICHEIX,B113,63490,63119,Condat-lès-Montboissier,63,,,63119000ZI0047,,,,,,,,,,,,,0,,,,,BR,futaies résineuses,,,1903,3.495647,45.566392
2021-1074257,2021-10-08,000001,Vente,1100,,,LE PICHEIX,B113,63490,63119,Condat-lès-Montboissier,63,,,63119000ZI0048,,,,,,,,,,,,,0,,,,,B,bois,,,2000,3.496621,45.565913
2021-1074257,2021-10-08,000001,Vente,1100,,,LE PICHEIX,B113,63490,63119,Condat-lès-Montboissier,63,,,63119000ZI0048,,,,,,,,,,,,,0,,,,,BR,futaies résineuses,,,6670,3.496621,45.565913
2021-1078410,2021-12-17,000002,Vente,55000,3,,LA CHASSAGNE,B039,63490,63119,Condat-lès-Montboissier,63,,,63119000ZV0053,,,,,,,,,,,,,0,3,Dépendance,,0,S,sols,,,1430,3.45633,45.557908
2021-1078410,2021-12-17,000002,Vente,55000,3,,LA CHASSAGNE,B039,63490,63119,Condat-lès-Montboissier,63,,,63119000ZV0053,,,,,,,,,,,,,0,1,Maison,96,4,S,sols,,,1430,3.45633,45.557908
2021-1079630,2021-12-30,000001,Vente,66000,,,LES PINATELLES,B116,63490,63119,Condat-lès-Montboissier,63,,,63119000ZH0054,,,,,,,,,,,,,0,,,,,BR,futaies résineuses,,,61830,3.505262,45.570603
2021-1079630,2021-12-30,000001,Vente,66000,,,GRAND CHAMP,B076,63490,63119,Condat-lès-Montboissier,63,,,63119000ZL0011,,,,,,,,,,,,,0,,,,,PA,pâtures,,,750,3.504883,45.550711
2021-1080952,2021-01-06,000001,Vente,4000,,,FAUGES,B060,63490,63119,Condat-lès-Montboissier,63,,,63119000ZH0104,,,,,,,,,,,,,0,,,,,BR,futaies résineuses,,,2760,3.500647,45.5652
2021-1080952,2021-01-06,000001,Vente,4000,,,LE CHAMP DES EPINES,B026,63490,63119,Condat-lès-Montboissier,63,,,63119000ZK0098,,,,,,,,,,,,,0,,,,,BR,futaies résineuses,,,34140,3.504384,45.55814
2021-1080952,2021-01-06,000001,Vente,4000,,,LES COTES,B050,63490,63119,Condat-lès-Montboissier,63,,,63119000ZM0153,,,,,,,,,,,,,0,,,,,BR,futaies résineuses,,,1404,3.482448,45.542022
2021-1081000,2021-02-03,000001,Vente,5000,5257,,LA PERRERIE,B111,63490,63119,Condat-lès-Montboissier,63,,,63119000ZP0257,,,,,,,,,,,,,0,3,Dépendance,,0,S,sols,,,432,3.474323,45.545681
2021-1081000,2021-02-03,000001,Vente,5000,17,,LA PERRERIE,B111,63490,63119,Condat-lès-Montboissier,63,,,63119000ZP0258,,,,,,,,,,,,,0,,,,,J,jardins,,,324,3.474366,45.545426
2021-1081617,2021-04-12,000001,Vente,242890,,,CHANTAGRELLE,B036,63490,63119,Condat-lès-Montboissier,63,,,63119000ZA0043,,,,,,,,,,,,,0,,,,,P,prés,,,680,3.446452,45.563673
2021-1081617,2021-04-12,000001,Vente,242890,12,,CHANTAGRELLE,B036,63490,63119,Condat-lès-Montboissier,63,,,63119000ZA0045,,,,,,,,,,,,,0,,,,,S,sols,,,103,3.446697,45.563856
2021-1081617,2021-04-12,000001,Vente,242890,14,,CHANTAGRELLE,B036,63490,63119,Condat-lès-Montboissier,63,,,63119000ZA0046,,,,,,,,,,,,,0,1,Maison,100,5,S,sols,,,126,3.446891,45.563893
2021-1081617,2021-04-12,000001,Vente,242890,14,,CHANTAGRELLE,B036,63490,63119,Condat-lès-Montboissier,63,,,63119000ZA0046,,,,,,,,,,,,,0,1,Maison,177,8,S,sols,,,126,3.446891,45.563893
2021-1081627,2021-01-21,000001,Vente,27500,4,,LA MICHINIE,B098,63490,63119,Condat-lès-Montboissier,63,,,63119000ZS0192,,,,,,,,,,,,,0,1,Maison,78,5,S,sols,,,102,3.462084,45.547028
2021-1081627,2021-01-21,000001,Vente,27500,6,,LA MICHINIE,B098,63490,63119,Condat-lès-Montboissier,63,,,63119000ZS0195,,,,,,,,,,,,,0,,,,,S,sols,,,408,3.462277,45.546982
2021-1081627,2021-01-21,000001,Vente,27500,,,LA MICHINIE,B098,63490,63119,Condat-lès-Montboissier,63,,,63119000ZS0214,,,,,,,,,,,,,0,,,,,T,terres,,,481,3.462473,45.546966
2021-1081627,2021-01-21,000001,Vente,27500,,,LA MICHINIE,B098,63490,63119,Condat-lès-Montboissier,63,,,63119000ZS0216,,,,,,,,,,,,,0,,,,,T,terres,,,757,3.462282,45.546693
2021-1081709,2021-04-08,000001,Vente,750,,,LES PINATELLES,B116,63490,63119,Condat-lès-Montboissier,63,,,63119000ZH0082,,,,,,,,,,,,,0,,,,,BF,futaies feuillues,,,2017,3.508894,45.564143
2021-1081709,2021-04-08,000001,Vente,750,,,LES PINATELLES,B116,63490,63119,Condat-lès-Montboissier,63,,,63119000ZH0083,,,,,,,,,,,,,0,,,,,PA,pâtures,,,3007,3.509998,45.564428
2021-1081794,2021-04-29,000001,Vente,35000,,,MONTBESSOUS,B100,63490,63119,Condat-lès-Montboissier,63,,,63119000ZI0109,,,,,,,,,,,,,0,,,,,BR,futaies résineuses,,,3572,3.496246,45.55695
2021-1081794,2021-04-29,000001,Vente,35000,,,MONTBESSOUS,B100,63490,63119,Condat-lès-Montboissier,63,,,63119000ZI0112,,,,,,,,,,,,,0,,,,,BR,futaies résineuses,,,4120,3.493318,45.5552
2021-1081794,2021-04-29,000001,Vente,35000,,,MONTBESSOUS,B100,63490,63119,Condat-lès-Montboissier,63,,,63119000ZI0113,,,,,,,,,,,,,0,,,,,BR,futaies résineuses,,,26490,3.49549,45.556033
