id_mutation,date_mutation,numero_disposition,nature_mutation,valeur_fonciere,adresse_numero,adresse_suffixe,adresse_nom_voie,adresse_code_voie,code_postal,code_commune,nom_commune,code_departement,ancien_code_commune,ancien_nom_commune,id_parcelle,ancien_id_parcelle,numero_volume,lot1_numero,lot1_surface_carrez,lot2_numero,lot2_surface_carrez,lot3_numero,lot3_surface_carrez,lot4_numero,lot4_surface_carrez,lot5_numero,lot5_surface_carrez,nombre_lots,code_type_local,type_local,surface_reelle_bati,nombre_pieces_principales,code_nature_culture,nature_culture,code_nature_culture_speciale,nature_culture_speciale,surface_terrain,longitude,latitude
2021-1066379,2021-05-18,000001,Vente,39247.81,5092,,LE BOURG,B249,63890,63174,Grandval,63,,,631740000C0453,,,,,,,,,,,,,0,1,Maison,66,3,S,sols,,,355,3.646605,45.598069
2021-1067206,2021-05-10,000002,Vente,50,,,LA COURTADE,B071,63890,63174,Grandval,63,,,631740000B0957,,,,,,,,,,,,,0,,,,,L,landes,,,96,3.647612,45.600012
2021-1067336,2021-05-31,000001,Vente,193000,,,LE MONTEL,B152,63890,63174,Grandval,63,,,631740000A0442,,,,,,,,,,,,,0,,,,,J,jardins,,,695,3.65912,45.614681
2021-1067336,2021-05-31,000001,Vente,193000,5010,,LE MONTEL,B152,63890,63174,Grandval,63,,,631740000A0443,,,,,,,,,,,,,0,1,Maison,150,5,S,sols,,,195,3.65915,45.614517
2021-1068186,2021-06-11,000001,Vente,81400,5033,,LA MAROTTE,B148,63890,63174,Grandval,63,,,631740000C0024,,,,,,,,,,,,,0,1,Maison,120,4,S,sols,,,572,3.645086,45.597352
2021-1070504,2021-07-16,000001,Vente,5000,,,LE COMBEAUD,B060,63890,63174,Grandval,63,,,631740000A0097,,,,,,,,,,,,,0,,,,,BR,futaies résineuses,,,4550,3.646099,45.608374
2021-1070504,2021-07-16,000001,Vente,5000,,,LES FONTETES,B095,63890,63174,Grandval,63,,,631740000A0812,,,,,,,,,,,,,0,,,,,P,prés,,,5802,3.643751,45.603853
2021-1072830,2021-09-04,000001,Vente,360,,,ENTREMEYAS,B086,63890,63174,Grandval,63,,,631740000A0266,,,,,,,,,,,,,0,,,,,BR,futaies résineuses,,,5515,3.642348,45.601767
2021-1073624,2021-09-20,000001,Vente,1500,,,LA COURTADE,B071,63890,63174,Grandval,63,,,631740000B0803,,,,,,,,,,,,,0,,,,,P,prés,,,304,3.648817,45.598957
2021-1073624,2021-09-20,000001,Vente,1500,,,LA COURTADE,B071,63890,63174,Grandval,63,,,631740000B0804,,,,,,,,,,,,,0,,,,,P,prés,,,4366,3.647903,45.599453
2021-1073717,2021-09-27,000001,Vente,220,,,LES PINATES,B170,63890,63174,Grandval,63,,,631740000A0176,,,,,,,,,,,,,0,,,,,BR,futaies résineuses,,,3765,3.651825,45.606129
2021-1074434,2021-09-23,000001,Vente,30000,,,LE BOURG,B249,63890,63174,Grandval,63,,,631740000B0561,,,,,,,,,,,,,0,,,,,PA,pâtures,,,50,3.646813,45.597798
2021-1074434,2021-09-23,000001,Vente,30000,5093,,LE BOURG,B249,63890,63174,Grandval,63,,,631740000B0562,,,,,,,,,,,,,0,1,Maison,40,3,S,sols,,,155,3.6469,45.597921
2021-1074434,2021-09-23,000001,Vente,30000,,,LE BOURG,B249,63890,63174,Grandval,63,,,631740000B0563,,,,,,,,,,,,,0,,,,,PA,pâtures,,,140,3.646995,45.597931
2021-1076783,2021-11-22,000001,Vente,2000,,,LE MONTEL,B152,63890,63174,Grandval,63,,,631740000A0445,,,,,,,,,,,,,0,,,,,J,jardins,,,760,3.658777,45.614664
2021-1077678,2021-12-01,000001,Vente,280500,,,LES FAYES,B092,63890,63174,Grandval,63,,,631740000A0099,,,,,,,,,,,,,0,,,,,PA,pâtures,,,5169,3.647125,45.608859
2021-1081079,2021-01-29,000001,Vente,1000,,,LA LICHERE,B138,63890,63174,Grandval,63,,,631740000A0019,,,,,,,,,,,,,0,,,,,BR,futaies résineuses,,,1220,3.640117,45.60616
2021-1081079,2021-01-29,000001,Vente,1000,,,LA LICHERE,B138,63890,63174,Grandval,63,,,631740000A0020,,,,,,,,,,,,,0,,,,,PA,pâtures,,,6000,3.639246,45.606126
2021-1081079,2021-01-29,000001,Vente,1000,,,LA LICHERE,B138,63890,63174,Grandval,63,,,631740000A0021,,,,,,,,,,,,,0,,,,,PA,pâtures,,,120,3.638363,45.605976
2021-1081218,2021-02-26,000001,Vente,3000,,,LES PINATES,B170,63890,63174,Grandval,63,,,631740000A0173,,,,,,,,,,,,,0,,,,,BR,futaies résineuses,,,4263,3.650886,45.605796
2021-1081218,2021-02-26,000001,Vente,3000,,,LES PINATES,B170,63890,63174,Grandval,63,,,631740000A0174,,,,,,,,,,,,,0,,,,,BR,futaies résineuses,,,1487,3.651163,45.606009
2021-1081707,2021-04-02,000001,Vente,27900,,,PRE GRAND,B193,63890,63174,Grandval,63,,,631740000C0333,,,,,,,,,,,,,0,,,,,P,prés,,,2865,3.630992,45.603783
2021-1081707,2021-04-02,000001,Vente,27900,,,PRE GRAND,B193,63890,63174,Grandval,63,,,631740000C0333,,,,,,,,,,,,,0,,,,,P,prés,,,2865,3.630992,45.603783
