id_mutation,date_mutation,numero_disposition,nature_mutation,valeur_fonciere,adresse_numero,adresse_suffixe,adresse_nom_voie,adresse_code_voie,code_postal,code_commune,nom_commune,code_departement,ancien_code_commune,ancien_nom_commune,id_parcelle,ancien_id_parcelle,numero_volume,lot1_numero,lot1_surface_carrez,lot2_numero,lot2_surface_carrez,lot3_numero,lot3_surface_carrez,lot4_numero,lot4_surface_carrez,lot5_numero,lot5_surface_carrez,nombre_lots,code_type_local,type_local,surface_reelle_bati,nombre_pieces_principales,code_nature_culture,nature_culture,code_nature_culture_speciale,nature_culture_speciale,surface_terrain,longitude,latitude
2021-1063413,2021-01-06,000001,Vente,47000,2,,IMP DES BROCS,0020,63270,63188,Laps,63,,,631880000C0101,,,,,,,,,,,,,0,1,Maison,32,2,S,sols,,,115,3.259458,45.667448
2021-1063886,2021-01-29,000001,Vente,187500,10,,CHE DES VIGNES,0062,63270,63188,Laps,63,,,63188000ZA0230,,,,,,,,,,,,,0,1,Maison,96,4,AG,terrains d'agrément,,,189,3.264082,45.673283
2021-1063886,2021-01-29,000001,Vente,187500,10,,CHE DES VIGNES,0062,63270,63188,Laps,63,,,63188000ZA0230,,,,,,,,,,,,,0,1,Maison,96,4,S,sols,,,500,3.264082,45.673283
2021-1063886,2021-01-29,000001,Vente,187500,,,VIGNES DE LAPS,B078,63270,63188,Laps,63,,,63188000ZA0233,,,,,,,,,,,,,0,,,,,AG,terrains d'agrément,,,31,3.264419,45.673282
2021-1063886,2021-01-29,000001,Vente,187500,,,VIGNES DE LAPS,B078,63270,63188,Laps,63,,,63188000ZA0234,,,,,,,,,,,,,0,,,,,AG,terrains d'agrément,,,342,3.264363,45.673293
2021-1065402,2021-04-21,000001,Vente,150000,132,,CHE DES GRAVEYROUX,0031,63270,63188,Laps,63,,,631880000C0002,,,,,,,,,,,,,0,1,Maison,132,5,S,sols,,,390,3.258345,45.668375
2021-1065402,2021-04-21,000001,Vente,150000,132,,CHE DES GRAVEYROUX,0031,63270,63188,Laps,63,,,631880000C0002,,,,,,,,,,,,,0,3,Dépendance,,0,S,sols,,,390,3.258345,45.668375
2021-1065402,2021-04-21,000001,Vente,150000,,,BENAUD,B004,63270,63188,Laps,63,,,631880000C0005,,,,,,,,,,,,,0,,,,,S,sols,,,30,3.258134,45.668337
2021-1065402,2021-04-21,000001,Vente,150000,,,BENAUD,B004,63270,63188,Laps,63,,,631880000C0006,,,,,,,,,,,,,0,,,,,S,sols,,,36,3.258178,45.668323
2021-1065402,2021-04-21,000001,Vente,150000,,,BENAUD,B004,63270,63188,Laps,63,,,631880000C0007,,,,,,,,,,,,,0,,,,,S,sols,,,180,3.258136,45.668285
2021-1065402,2021-04-21,000001,Vente,150000,5383,,CHE DES GRAVEYROUX,0031,63270,63188,Laps,63,,,631880000C0008,,,,,,,,,,,,,0,3,Dépendance,,0,S,sols,,,72,3.258023,45.668243
2021-1065402,2021-04-21,000001,Vente,150000,,,BENAUD,B004,63270,63188,Laps,63,,,631880000C0731,,,,,,,,,,,,,0,,,,,S,sols,,,22,3.258324,45.668498
2021-1065918,2021-05-05,000001,Vente,147946,5427,,IMP DES CAVES,0023,63270,63188,Laps,63,,,631880000C0098,,,,,,,,,,,,,0,1,Maison,94,4,S,sols,,,33,3.259601,45.667349
2021-1065918,2021-05-05,000001,Vente,147946,5428,,IMP DES CAVES,0023,63270,63188,Laps,63,,,631880000C0100,,,,,,,,,,,,,0,3,Dépendance,,0,S,sols,,,50,3.259605,45.667469
2021-1065918,2021-05-05,000001,Vente,147946,5428,,IMP DES CAVES,0023,63270,63188,Laps,63,,,631880000C0100,,,,,,,,,,,,,0,3,Dépendance,,0,S,sols,,,50,3.259605,45.667469
2021-1068167,2021-06-22,000001,Vente,126945,,,BOURG DE LAPS,B041,63270,63188,Laps,63,,,631880000A0141,,,,,,,,,,,,,0,,,,,P,prés,,,1066,3.267746,45.673333
2021-1068167,2021-06-22,000001,Vente,126945,140,,RTE DE BILLOM,0015,63270,63188,Laps,63,,,631880000A0142,,,,,,,,,,,,,0,3,Dépendance,,0,S,sols,,,248,3.267867,45.673468
2021-1068167,2021-06-22,000001,Vente,126945,140,,RTE DE BILLOM,0015,63270,63188,Laps,63,,,631880000A0142,,,,,,,,,,,,,0,1,Maison,100,3,S,sols,,,248,3.267867,45.673468
2021-1068167,2021-06-22,000001,Vente,126945,,,BOURG DE LAPS,B041,63270,63188,Laps,63,,,631880000A0143,,,,,,,,,,,,,0,,,,,S,sols,,,330,3.267573,45.673505
2021-1068167,2021-06-22,000001,Vente,126945,,,BOURG DE LAPS,B041,63270,63188,Laps,63,,,631880000A1365,,,,,,,,,,,,,0,,,,,BT,taillis simples,,,603,3.26736,45.673012
2021-1068730,2021-06-24,000001,Vente,2500,,,LA GHONCHERE,B035,63270,63188,Laps,63,,,63188000ZD0087,,,,,,,,,,,,,0,,,,,T,terres,,,15300,3.266017,45.663369
2021-1070891,2021-08-03,000001,Vente,190300,,,BENAUD,B004,63270,63188,Laps,63,,,631880000C0003,,,,,,,,,,,,,0,,,,,S,sols,,,30,3.258162,45.668426
2021-1070891,2021-08-03,000001,Vente,190300,148,,CHE DES GRAVEYROUX,0031,63270,63188,Laps,63,,,631880000C0730,,,,,,,,,,,,,0,1,Maison,145,5,S,sols,,,123,3.258214,45.668485
2021-1070891,2021-08-03,000001,Vente,190300,,,CHE DES GRAVEYROUX,0031,63270,63188,Laps,63,,,631880000C0840,,,,,,,,,,,,,0,,,,,S,sols,,,24,3.258223,45.668449
2021-1070891,2021-08-03,000001,Vente,190300,,,GRAVEYROUX,B038,63270,63188,Laps,63,,,631880000D1646,,,,,,,,,,,,,0,,,,,J,jardins,,,153,3.257903,45.668586
2021-1073100,2021-08-31,000001,Vente,148200,116,,RUE DE LA CHAPELLE,0024,63270,63188,Laps,63,,,631880000C0055,,,,,,,,,,,,,0,1,Maison,88,3,S,sols,,,35,3.259321,45.667281
2021-1073100,2021-08-31,000001,Vente,148200,,,BENAUD,B004,63270,63188,Laps,63,,,631880000C0056,,,,,,,,,,,,,0,,,,,S,sols,,,30,3.259247,45.667298
2021-1074068,2021-09-24,000002,Vente,74850,,,BOURRAT,B008,63270,63188,Laps,63,,,63188000ZE0276,,,,,,,,,,,,,0,,,,,T,terres,,,678,3.253188,45.660203
2021-1074068,2021-09-24,000002,Vente,74850,,,BOURRAT,B008,63270,63188,Laps,63,,,63188000ZE0281,,,,,,,,,,,,,0,,,,,T,terres,,,66,3.253135,45.660116
2021-1077570,2021-12-03,000001,Vente,40000,,,BOURG DE LAPS,B041,63270,63188,Laps,63,,,631880000A1429,,,,,,,,,,,,,0,,,,,T,terres,,,751,3.266871,45.673805
2021-1077570,2021-12-03,000001,Vente,40000,,,BOURG DE LAPS,B041,63270,63188,Laps,63,,,631880000A1430,,,,,,,,,,,,,0,,,,,T,terres,,,751,3.267239,45.673795
2021-1077845,2021-12-03,000001,Vente,40000,,,BOURG DE LAPS,B041,63270,63188,Laps,63,,,631880000A1430,,,,,,,,,,,,,0,,,,,T,terres,,,751,3.267239,45.673795
2021-1078442,2021-12-01,000001,Vente,2000,,,FONT BENAUD,B031,63270,63188,Laps,63,,,63188000ZD0105,,,,,,,,,,,,,0,,,,,T,terres,,,5000,3.263902,45.664221
