id_mutation,date_mutation,numero_disposition,nature_mutation,valeur_fonciere,adresse_numero,adresse_suffixe,adresse_nom_voie,adresse_code_voie,code_postal,code_commune,nom_commune,code_departement,ancien_code_commune,ancien_nom_commune,id_parcelle,ancien_id_parcelle,numero_volume,lot1_numero,lot1_surface_carrez,lot2_numero,lot2_surface_carrez,lot3_numero,lot3_surface_carrez,lot4_numero,lot4_surface_carrez,lot5_numero,lot5_surface_carrez,nombre_lots,code_type_local,type_local,surface_reelle_bati,nombre_pieces_principales,code_nature_culture,nature_culture,code_nature_culture_speciale,nature_culture_speciale,surface_terrain,longitude,latitude
2021-1063241,2021-01-08,000001,Vente,,,,CHANLAT,B029,63190,63229,Moissat,63,,,632290000D2522,,,,,,,,,,,,,0,,,,,S,sols,,,3,3.355555,45.773753
2021-1063241,2021-01-08,000001,Vente,,,,CHANLAT,B029,63190,63229,Moissat,63,,,632290000D2523,,,,,,,,,,,,,0,,,,,S,sols,,,351,3.355501,45.773998
2021-1063241,2021-01-08,000002,Vente,,,,BOURG DE MOISSAT HAUT,B092,63190,63229,Moissat,63,,,632290000D2527,,,,,,,,,,,,,0,,,,,AB,terrains a bâtir,,,300,3.355511,45.77464
2021-1063241,2021-01-08,000002,Vente,,,,BOURG DE MOISSAT HAUT,B092,63190,63229,Moissat,63,,,632290000D2531,,,,,,,,,,,,,0,,,,,S,sols,,,511,3.355411,45.774553
2021-1063241,2021-01-08,000002,Vente,,,,CHANLAT,B029,63190,63229,Moissat,63,,,63229000ZO0423,,,,,,,,,,,,,0,,,,,AB,terrains a bâtir,,,392,3.355676,45.774627
2021-1063791,2021-02-03,000001,Vente,6000,,,SUR COURCOUR,B206,63190,63229,Moissat,63,,,63229000ZS0026,,,,,,,,,,,,,0,,,,,T,terres,,,500,3.32845,45.792908
2021-1063791,2021-02-03,000001,Vente,6000,,,SUR COURCOUR,B206,63190,63229,Moissat,63,,,63229000ZS0026,,,,,,,,,,,,,0,,,,,VI,vignes,,,1543,3.32845,45.792908
2021-1063791,2021-02-03,000001,Vente,6000,,,SUR COURCOUR,B206,63190,63229,Moissat,63,,,63229000ZS0026,,,,,,,,,,,,,0,,,,,T,terres,,,1632,3.32845,45.792908
2021-1063791,2021-02-03,000001,Vente,6000,,,SUR COURCOUR,B206,63190,63229,Moissat,63,,,63229000ZS0026,,,,,,,,,,,,,0,,,,,VI,vignes,,,2685,3.32845,45.792908
2021-1063801,2021-02-10,000001,Vente,50000,,,LA BOURLE,B012,63190,63229,Moissat,63,,,63229000ZK0405,,,,,,,,,,,,,0,,,,,AB,terrains a bâtir,,,1034,3.356882,45.768563
2021-1063801,2021-02-10,000001,Vente,50000,,,LA BOURLE,B012,63190,63229,Moissat,63,,,63229000ZK0407,,,,,,,,,,,,,0,,,,,S,sols,,,248,3.35633,45.768675
2021-1063814,2021-02-17,000001,Vente,60000,,,SUR LES SERVES,B201,63190,63229,Moissat,63,,,63229000ZI0266,,,,,,,,,,,,,0,,,,,AB,terrains a bâtir,,,1076,3.364253,45.780379
2021-1063822,2021-02-10,000001,Vente,25000,,,MOISSAT BAS,B091,63190,63229,Moissat,63,,,632290000C0060,,,,,,,,,,,,,0,,,,,S,sols,,,60,3.361103,45.779565
2021-1063822,2021-02-10,000001,Vente,25000,5300,,RUE DU MOUSTIER,0046,63190,63229,Moissat,63,,,632290000C0061,,,,,,,,,,,,,0,1,Maison,103,5,S,sols,,,40,3.361229,45.779567
2021-1064178,2021-03-02,000001,Vente,69000,5106,,RUE NEUVE,0038,63190,63229,Moissat,63,,,632290000D2559,,,,,,,,,,,,,0,1,Maison,84,1,S,sols,,,91,3.354229,45.77401
2021-1064207,2021-02-10,000001,Vente,32500,,,BOURG DE MOISSAT HAUT,B092,63190,63229,Moissat,63,,,632290000D2329,,,,,,,,,,,,,0,,,,,J,jardins,,,52,3.351556,45.773161
2021-1064207,2021-02-10,000001,Vente,32500,,,BOURG DE MOISSAT HAUT,B092,63190,63229,Moissat,63,,,632290000D2537,,,,,,,,,,,,,0,,,,,T,terres,,,72,3.351566,45.773092
2021-1064207,2021-02-10,000001,Vente,32500,,,BOURG DE MOISSAT HAUT,B092,63190,63229,Moissat,63,,,632290000D2538,,,,,,,,,,,,,0,,,,,J,jardins,,,7,3.351608,45.773372
2021-1064207,2021-02-10,000001,Vente,32500,,,BOURG DE MOISSAT HAUT,B092,63190,63229,Moissat,63,,,632290000D2541,,,,,,,,,,,,,0,,,,,J,jardins,,,70,3.351596,45.773277
2021-1064207,2021-02-10,000001,Vente,32500,,,BOURG DE MOISSAT HAUT,B092,63190,63229,Moissat,63,,,632290000D2553,,,,,,,,,,,,,0,,,,,J,jardins,,,266,3.351723,45.773133
2021-1064207,2021-02-10,000001,Vente,32500,,,BOURG DE MOISSAT HAUT,B092,63190,63229,Moissat,63,,,632290000D2556,,,,,,,,,,,,,0,,,,,S,sols,,,105,3.351747,45.773036
2021-1064565,2021-03-11,000001,Vente,1500,,,SUR BOURNAZET,B193,63190,63229,Moissat,63,,,63229000ZH0095,,,,,,,,,,,,,0,,,,,T,terres,,,1170,3.35613,45.780072
2021-1064676,2021-02-26,000001,Vente,18600,,,LE TOUR,B159,63190,63229,Moissat,63,,,63229000ZN0115,,,,,,,,,,,,,0,,,,,T,terres,,,12355,3.336353,45.76674
2021-1064676,2021-02-26,000001,Vente,18600,,,LE TOUR,B159,63190,63229,Moissat,63,,,63229000ZN0115,,,,,,,,,,,,,0,,,,,T,terres,,,12355,3.336353,45.76674
2021-1065427,2021-04-09,000001,Vente,231,,,PRE ROUGER,B130,63190,63229,Moissat,63,,,63229000ZK0054,,,,,,,,,,,,,0,,,,,E,eaux,FOSSE,Fosse,770,3.368345,45.776972
2021-1065430,2021-04-15,000001,Vente,185000,5001,,RUE DU PRIEURE,0049,63190,63229,Moissat,63,,,632290000B1476,,,,,,,,,,,,,0,1,Maison,100,5,S,sols,,,738,3.362524,45.779877
2021-1065430,2021-04-15,000001,Vente,185000,,,MOISSAT BAS,B091,63190,63229,Moissat,63,,,632290000B1477,,,,,,,,,,,,,0,,,,,S,sols,,,130,3.362323,45.779785
2021-1065897,2021-04-24,000001,Vente,35000,5002,,RUE DU PRIEURE,0049,63190,63229,Moissat,63,,,632290000B1473,,,,,,,,,,,,,0,1,Maison,33,1,S,sols,,,57,3.362159,45.77961
2021-1066460,2021-05-26,000001,Vente,215390,5664,,CHE DES BIARRES,0004,63190,63229,Moissat,63,,,632290000D1275,,,,,,,,,,,,,0,1,Maison,84,4,S,sols,,,364,3.353957,45.778521
2021-1067461,2021-05-22,000001,Vente,82000,3,,RUE DE LA FORGE,0026,63190,63229,Moissat,63,,,632290000D1466,,,,,,,,,,,,,0,1,Maison,49,1,S,sols,,,95,3.353745,45.7761
2021-1067594,2021-05-07,000001,Vente,20000,,,MOISSAT BAS,B091,63190,63229,Moissat,63,,,632290000C0014,,,,,,,,,,,,,0,,,,,J,jardins,,,100,3.363727,45.7779
2021-1067594,2021-05-07,000001,Vente,20000,,,MOISSAT BAS,B091,63190,63229,Moissat,63,,,632290000C0028,,,,,,,,,,,,,0,,,,,S,sols,,,107,3.36337,45.777955
2021-1067594,2021-05-07,000001,Vente,20000,,,MOISSAT BAS,B091,63190,63229,Moissat,63,,,632290000C0029,,,,,,,,,,,,,0,,,,,S,sols,,,138,3.363325,45.778064
2021-1067749,2021-05-27,000001,Vente,,,,BOURG DE MOISSAT HAUT,B092,63190,63229,Moissat,63,,,632290000D2525,,,,,,,,,,,,,0,,,,,AB,terrains a bâtir,,,713,3.355096,45.774853
2021-1067749,2021-05-27,000001,Vente,,,,BOURG DE MOISSAT HAUT,B092,63190,63229,Moissat,63,,,632290000D2531,,,,,,,,,,,,,0,,,,,S,sols,,,511,3.355411,45.774553
2021-1067749,2021-05-27,000002,Vente,,,,CHANLAT,B029,63190,63229,Moissat,63,,,632290000D2522,,,,,,,,,,,,,0,,,,,S,sols,,,3,3.355555,45.773753
2021-1067749,2021-05-27,000002,Vente,,,,CHANLAT,B029,63190,63229,Moissat,63,,,632290000D2523,,,,,,,,,,,,,0,,,,,S,sols,,,351,3.355501,45.773998
2021-1067752,2021-05-27,000001,Vente,11475,,,MOISSAT BAS,B091,63190,63229,Moissat,63,,,632290000B1456,,,,,,,,,,,,,0,,,,,B,bois,SAULE,Saulaie ou saussaie,135,3.361757,45.779057
2021-1067768,2021-04-30,000001,Vente,50000,,,L HERISSON,B075,63190,63229,Moissat,63,,,632290000D2450,,,,,,,,,,,,,0,,,,,S,sols,,,585,3.352107,45.778248
2021-1067768,2021-04-30,000001,Vente,50000,,,L HERISSON,B075,63190,63229,Moissat,63,,,632290000D2450,,,,,,,,,,,,,0,,,,,VI,vignes,,,195,3.352107,45.778248
2021-1067768,2021-04-30,000001,Vente,50000,,,L HERISSON,B075,63190,63229,Moissat,63,,,632290000D2451,,,,,,,,,,,,,0,,,,,T,terres,,,257,3.351562,45.778351
2021-1067768,2021-04-30,000001,Vente,50000,,,L HERISSON,B075,63190,63229,Moissat,63,,,632290000D2451,,,,,,,,,,,,,0,,,,,VI,vignes,,,153,3.351562,45.778351
2021-1068073,2021-06-08,000001,Vente,30942,,,PUY BAYOUX,B133,63190,63229,Moissat,63,,,63229000ZE0070,,,,,,,,,,,,,0,,,,,T,terres,,,1100,3.360229,45.795057
2021-1068073,2021-06-08,000001,Vente,30942,,,PUY BAYOUX,B133,63190,63229,Moissat,63,,,63229000ZE0071,,,,,,,,,,,,,0,,,,,T,terres,,,8910,3.36071,45.795268
2021-1068073,2021-06-08,000001,Vente,30942,,,PUY BAYOUX,B133,63190,63229,Moissat,63,,,63229000ZE0072,,,,,,,,,,,,,0,,,,,T,terres,,,8380,3.361611,45.795406
2021-1068073,2021-06-08,000001,Vente,30942,,,LA RONZIERE DES MOINES,B147,63190,63229,Moissat,63,,,63229000ZE0094,,,,,,,,,,,,,0,,,,,T,terres,,,6250,3.359015,45.791467
2021-1068073,2021-06-08,000001,Vente,30942,,,GERI,B064,63190,63229,Moissat,63,,,63229000ZI0133,,,,,,,,,,,,,0,,,,,P,prés,,,4150,3.373889,45.780758
2021-1068073,2021-06-08,000001,Vente,30942,,,GERI,B064,63190,63229,Moissat,63,,,63229000ZI0134,,,,,,,,,,,,,0,,,,,P,prés,,,5590,3.373634,45.780525
2021-1068074,2021-06-08,000002,Vente,40644,,,PUY BAYOUX,B133,63190,63229,Moissat,63,,,63229000ZE0066,,,,,,,,,,,,,0,,,,,T,terres,,,16000,3.358626,45.79491
2021-1068074,2021-06-08,000002,Vente,40644,,,PUY BAYOUX,B133,63190,63229,Moissat,63,,,63229000ZE0066,,,,,,,,,,,,,0,,,,,T,terres,,,640,3.358626,45.79491
2021-1068074,2021-06-08,000002,Vente,40644,,,GRANDE CARRIERE,B068,63190,63229,Moissat,63,,,63229000ZI0022,,,,,,,,,,,,,0,,,,,T,terres,,,7950,3.363364,45.786581
2021-1068074,2021-06-08,000002,Vente,40644,,,GRANDE CARRIERE,B068,63190,63229,Moissat,63,,,63229000ZI0022,,,,,,,,,,,,,0,,,,,T,terres,,,3600,3.363364,45.786581
2021-1068074,2021-06-08,000002,Vente,40644,,,ERRANT,B056,63190,63229,Moissat,63,,,63229000ZI0092,,,,,,,,,,,,,0,,,,,P,prés,,,16970,3.37152,45.787348
2021-1068162,2021-06-16,000001,Vente,55000,5237,,RUE DU FOUR,0041,63190,63229,Moissat,63,,,632290000B1511,,,,,,,,,,,,,0,1,Maison,49,1,S,sols,,,80,3.362274,45.780591
2021-1069298,2021-07-08,000001,Vente,9414,,,LA RONZIERE DES MOINES,B147,63190,63229,Moissat,63,,,63229000ZE0092,,,,,,,,,,,,,0,,,,,T,terres,,,9530,3.35993,45.792648
2021-1069298,2021-07-08,000001,Vente,9414,,,LA PALLE,B096,63190,63229,Moissat,63,,,63229000ZH0044,,,,,,,,,,,,,0,,,,,T,terres,,,4950,3.360582,45.787837
2021-1069298,2021-07-08,000001,Vente,9414,,,LA PALLE,B096,63190,63229,Moissat,63,,,63229000ZH0044,,,,,,,,,,,,,0,,,,,T,terres,,,4950,3.360582,45.787837
2021-1069298,2021-07-08,000001,Vente,9414,,,GERI,B064,63190,63229,Moissat,63,,,63229000ZI0141,,,,,,,,,,,,,0,,,,,P,prés,,,10850,3.37097,45.779016
2021-1069298,2021-07-08,000001,Vente,9414,,,GERI,B064,63190,63229,Moissat,63,,,63229000ZI0227,,,,,,,,,,,,,0,,,,,P,prés,,,1100,3.371485,45.778959
2021-1070114,2021-07-16,000001,Vente,35000,,,LES BIARRES,B007,63190,63229,Moissat,63,,,632290000D1269,,,,,,,,,,,,,0,,,,,T,terres,,,505,3.353152,45.778434
2021-1070575,2021-07-30,000001,Vente,35834.6,,,BOURNAZET,B013,63190,63229,Moissat,63,,,63229000ZH0070,,,,,,,,,,,,,0,,,,,T,terres,,,15120,3.355611,45.783181
2021-1070575,2021-07-30,000001,Vente,35834.6,,,LES PETITS VIGNOTS,B171,63190,63229,Moissat,63,,,63229000ZL0054,,,,,,,,,,,,,0,,,,,T,terres,,,2260,3.367302,45.767529
2021-1070575,2021-07-30,000001,Vente,35834.6,,,LES PETITS VIGNOTS,B171,63190,63229,Moissat,63,,,63229000ZL0054,,,,,,,,,,,,,0,,,,,T,terres,,,2150,3.367302,45.767529
2021-1070575,2021-07-30,000001,Vente,35834.6,,,LES PETITS VIGNOTS,B171,63190,63229,Moissat,63,,,63229000ZL0055,,,,,,,,,,,,,0,,,,,T,terres,,,190,3.367835,45.767817
2021-1070575,2021-07-30,000001,Vente,35834.6,,,FONT RIGAUD,B059,63190,63229,Moissat,63,,,63229000ZM0025,,,,,,,,,,,,,0,,,,,T,terres,,,17576,3.351847,45.765025
2021-1070575,2021-07-30,000001,Vente,35834.6,,,FONT RIGAUD,B059,63190,63229,Moissat,63,,,63229000ZM0025,,,,,,,,,,,,,0,,,,,T,terres,,,4394,3.351847,45.765025
2021-1070575,2021-07-30,000001,Vente,35834.6,,,MARY,B089,63190,63229,Moissat,63,,,63229000ZP0047,,,,,,,,,,,,,0,,,,,T,terres,,,17950,3.342368,45.777623
2021-1071495,2021-08-18,000001,Vente,23600.71,,,BOURG DE MOISSAT HAUT,B092,63190,63229,Moissat,63,,,632290000D1747,,,,,,,,,,,,,0,,,,,S,sols,,,20,3.354347,45.773736
2021-1071495,2021-08-18,000001,Vente,23600.71,,,LES SERVES,B153,63190,63229,Moissat,63,,,63229000ZI0185,,,,,,,,,,,,,0,,,,,P,prés,,,1680,3.365019,45.781614
2021-1071495,2021-08-18,000001,Vente,23600.71,,,LES SERVES,B153,63190,63229,Moissat,63,,,63229000ZI0186,,,,,,,,,,,,,0,,,,,P,prés,,,1070,3.365114,45.781622
2021-1071495,2021-08-18,000001,Vente,23600.71,,,LES OIES,B095,63190,63229,Moissat,63,,,63229000ZK0015,,,,,,,,,,,,,0,,,,,T,terres,,,8960,3.361078,45.777452
2021-1072437,2021-09-07,000001,Vente,5000,,,BOURG DE MOISSAT HAUT,B092,63190,63229,Moissat,63,,,632290000D1889,,,,,,,,,,,,,0,,,,,S,sols,,,37,3.352797,45.775451
2021-1072529,2021-09-13,000001,Vente,34000,,,BOURG DE MOISSAT HAUT,B092,63190,63229,Moissat,63,,,632290000D1935,,,,,,,,,,,,,0,,,,,S,sols,,,28,3.353391,45.774445
2021-1072529,2021-09-13,000001,Vente,34000,,,RUE DE L ANCIENNE POSTE,0002,63190,63229,Moissat,63,,,632290000D1937,,,,,,,,,,,,,0,,,,,S,sols,,,87,3.35339,45.774329
2021-1073655,2021-09-24,000001,Vente,10000,,,SOUS LES OIES,B184,63190,63229,Moissat,63,,,63229000ZK0011,,,,,,,,,,,,,0,,,,,J,jardins,,,290,3.359886,45.7789
2021-1073974,2021-10-08,000001,Vente,50000,,,SOUS LE PUY,B207,63190,63229,Moissat,63,,,63229000ZO0366,,,,,,,,,,,,,0,,,,,VI,vignes,,,678,3.356856,45.771736
2021-1073974,2021-10-08,000001,Vente,50000,,,SOUS LE PUY,B207,63190,63229,Moissat,63,,,63229000ZO0368,,,,,,,,,,,,,0,,,,,VI,vignes,,,329,3.356924,45.77161
2021-1075118,2021-10-11,000001,Vente,62000,,,LES OIES,B095,63190,63229,Moissat,63,,,63229000ZK0385,,,,,,,,,,,,,0,,,,,S,sols,,,243,3.35865,45.776674
2021-1075118,2021-10-11,000001,Vente,62000,5729,,CHE DE CHARLIAT,0069,63190,63229,Moissat,63,,,63229000ZK0386,,,,,,,,,,,,,0,3,Dépendance,,0,S,sols,,,994,3.358994,45.777004
2021-1075150,2021-10-19,000001,Vente,43000,,,SUR LES SERVES,B201,63190,63229,Moissat,63,,,63229000ZI0267,,,,,,,,,,,,,0,,,,,AB,terrains a bâtir,,,880,3.363833,45.780309
2021-1075468,2021-10-22,000003,Echange,2530,,,MOISSAT BAS,B091,63190,63229,Moissat,63,,,632290000C2386,,,,,,,,,,,,,0,,,,,S,sols,,,73,3.36082,45.779414
2021-1075469,2021-10-22,000004,Echange,2740,,,MOISSAT BAS,B091,63190,63229,Moissat,63,,,632290000C2384,,,,,,,,,,,,,0,,,,,S,sols,,,79,3.360721,45.779312
2021-1075507,2021-10-22,000001,Vente,7000,,,MOISSAT BAS,B091,63190,63229,Moissat,63,,,632290000C0068,,,,,,,,,,,,,0,,,,,S,sols,,,202,3.360803,45.779495
2021-1075762,2021-11-05,000001,Vente,228850,5676,,CHE DU LAC,0034,63190,63229,Moissat,63,,,63229000ZO0181,,,,,,,,,,,,,0,1,Maison,93,4,S,sols,,,220,3.353786,45.772492
2021-1075762,2021-11-05,000001,Vente,228850,,,BOURG DE MOISSAT HAUT,B092,63190,63229,Moissat,63,,,63229000ZO0182,,,,,,,,,,,,,0,,,,,S,sols,,,250,3.353809,45.77259
2021-1076569,2021-11-15,000001,Vente,331550,8,,RTE DE BILLOM,0009,63190,63229,Moissat,63,,,632290000C2370,,,,,,,,,,,,,0,3,Dépendance,,0,S,sols,,,692,3.357654,45.777632
2021-1076569,2021-11-15,000001,Vente,331550,8,,RTE DE BILLOM,0009,63190,63229,Moissat,63,,,632290000C2370,,,,,,,,,,,,,0,1,Maison,129,4,S,sols,,,692,3.357654,45.777632
2021-1076569,2021-11-15,000001,Vente,331550,8,,RTE DE BILLOM,0009,63190,63229,Moissat,63,,,632290000C2378,,,,,,,,,,,,,0,,,,,S,sols,,,50,3.357767,45.7778
2021-1076595,2021-11-19,000001,Vente,217950,5107,,RUE NEUVE,0038,63190,63229,Moissat,63,,,632290000D2517,,,,,,,,,,,,,0,1,Maison,110,5,S,sols,,,499,3.354477,45.773861
2021-1076595,2021-11-19,000001,Vente,217950,,,BOURG DE MOISSAT HAUT,B092,63190,63229,Moissat,63,,,632290000D2519,,,,,,,,,,,,,0,,,,,S,sols,,,2,3.354389,45.774004
2021-1076595,2021-11-19,000001,Vente,217950,,,BOURG DE MOISSAT HAUT,B092,63190,63229,Moissat,63,,,632290000D2520,,,,,,,,,,,,,0,,,,,S,sols,,,10,3.354596,45.773925
2021-1076671,2021-11-02,000001,Vente,15000,,,SOUS LES LITTES,B183,63190,63229,Moissat,63,,,63229000ZO0014,,,,,,,,,,,,,0,,,,,P,prés,,,5345,3.345726,45.770371
2021-1076671,2021-11-02,000001,Vente,15000,,,SOUS LES LITTES,B183,63190,63229,Moissat,63,,,63229000ZO0014,,,,,,,,,,,,,0,,,,,P,prés,,,5345,3.345726,45.770371
2021-1076671,2021-11-02,000001,Vente,15000,,,SOUS LES LITTES,B183,63190,63229,Moissat,63,,,63229000ZO0015,,,,,,,,,,,,,0,,,,,P,prés,,,2650,3.346022,45.770552
2021-1076671,2021-11-02,000001,Vente,15000,,,SOUS LES LITTES,B183,63190,63229,Moissat,63,,,63229000ZO0016,,,,,,,,,,,,,0,,,,,P,prés,,,2650,3.345822,45.77065
2021-1076678,2021-11-30,000001,Vente,180000,5551,,CHE DES BIARRES,0004,63190,63229,Moissat,63,,,632290000D2449,,,,,,,,,,,,,0,1,Maison,95,4,S,sols,,,659,3.354725,45.777913
2021-1076678,2021-11-30,000001,Vente,180000,5551,,CHE DES BIARRES,0004,63190,63229,Moissat,63,,,632290000D2449,,,,,,,,,,,,,0,1,Maison,95,4,P,prés,,,555,3.354725,45.777913
2021-1076878,2021-12-02,000001,Vente,8800,,,LASCHAMPS,B079,63190,63229,Moissat,63,,,63229000ZN0024,,,,,,,,,,,,,0,,,,,T,terres,,,5890,3.334405,45.770391
2021-1077426,2021-11-29,000002,Vente,85000,,,BOURG DE MOISSAT HAUT,B092,63190,63229,Moissat,63,,,632290000D2560,,,,,,,,,,,,,0,,,,,S,sols,,,134,3.354136,45.773975
2021-1077426,2021-11-29,000002,Vente,85000,,,BOURG DE MOISSAT HAUT,B092,63190,63229,Moissat,63,,,632290000D2573,,,,,,,,,,,,,0,,,,,S,sols,,,38,3.354162,45.77392
2021-1077426,2021-11-29,000002,Vente,85000,,,BOURG DE MOISSAT HAUT,B092,63190,63229,Moissat,63,,,632290000D2574,,,,,,,,,,,,,0,,,,,S,sols,,,20,3.354209,45.773925
2021-1077426,2021-11-29,000002,Vente,85000,,,BOURG DE MOISSAT HAUT,B092,63190,63229,Moissat,63,,,632290000D2575,,,,,,,,,,,,,0,,,,,S,sols,,,87,3.354212,45.773861
2021-1078453,2021-12-10,000001,Vente,340600,14,,CHE DE CHARLIAT,0069,63190,63229,Moissat,63,,,63229000ZK0376,,,,,,,,,,,,,0,3,Dépendance,,0,S,sols,,,799,3.359699,45.776142
2021-1078453,2021-12-10,000001,Vente,340600,14,,CHE DE CHARLIAT,0069,63190,63229,Moissat,63,,,63229000ZK0376,,,,,,,,,,,,,0,1,Maison,111,4,S,sols,,,799,3.359699,45.776142
2021-1078453,2021-12-10,000001,Vente,340600,14,,CHE DE CHARLIAT,0069,63190,63229,Moissat,63,,,63229000ZK0376,,,,,,,,,,,,,0,3,Dépendance,,0,S,sols,,,799,3.359699,45.776142
2021-1079010,2021-12-17,000001,Vente,3117,,,GRAVEIROUX,B071,63190,63229,Moissat,63,,,63229000ZK0094,,,,,,,,,,,,,0,,,,,T,terres,,,5330,3.370341,45.770926
