id_mutation,date_mutation,numero_disposition,nature_mutation,valeur_fonciere,adresse_numero,adresse_suffixe,adresse_nom_voie,adresse_code_voie,code_postal,code_commune,nom_commune,code_departement,ancien_code_commune,ancien_nom_commune,id_parcelle,ancien_id_parcelle,numero_volume,lot1_numero,lot1_surface_carrez,lot2_numero,lot2_surface_carrez,lot3_numero,lot3_surface_carrez,lot4_numero,lot4_surface_carrez,lot5_numero,lot5_surface_carrez,nombre_lots,code_type_local,type_local,surface_reelle_bati,nombre_pieces_principales,code_nature_culture,nature_culture,code_nature_culture_speciale,nature_culture_speciale,surface_terrain,longitude,latitude
2021-1069676,2021-07-22,000001,Vente,42750,,,LE FOURNIAL,B073,63580,63328,Sainte-Catherine,63,,,633280000A0835,,,,,,,,,,,,,0,,,,,S,sols,,,213,3.486347,45.45258
2021-1069676,2021-07-22,000001,Vente,42750,,,LE FOURNIAL,B073,63580,63328,Sainte-Catherine,63,,,633280000A0838,,,,,,,,,,,,,0,,,,,T,terres,,,19,3.486371,45.452833
2021-1069676,2021-07-22,000001,Vente,42750,,,LE FOURNIAL,B073,63580,63328,Sainte-Catherine,63,,,633280000A0883,,,,,,,,,,,,,0,,,,,P,prés,,,1132,3.486708,45.452937
2021-1069676,2021-07-22,000001,Vente,42750,,,LE FOURNIAL,B073,63580,63328,Sainte-Catherine,63,,,633280000A0885,,,,,,,,,,,,,0,,,,,S,sols,,,37,3.486435,45.452639
2021-1069676,2021-07-22,000001,Vente,42750,5041,,LE FOURNIAL,B073,63580,63328,Sainte-Catherine,63,,,633280000A0886,,,,,,,,,,,,,0,1,Maison,75,4,S,sols,,,991,3.48672,45.452834
2021-1071570,2021-07-30,000001,Vente,143010,,,CHOVET,B048,63580,63328,Sainte-Catherine,63,,,633280000C0120,,,,,,,,,,,,,0,,,,,L,landes,,,235,3.463019,45.452246
2021-1071570,2021-07-30,000001,Vente,143010,,,CHOVET,B048,63580,63328,Sainte-Catherine,63,,,633280000C0121,,,,,,,,,,,,,0,,,,,PA,pâtures,,,1391,3.463194,45.452433
2021-1071570,2021-07-30,000001,Vente,143010,,,CHOVET,B048,63580,63328,Sainte-Catherine,63,,,633280000C0122,,,,,,,,,,,,,0,,,,,J,jardins,,,536,3.462655,45.452524
2021-1071570,2021-07-30,000001,Vente,143010,,,CHOVET,B048,63580,63328,Sainte-Catherine,63,,,633280000C0123,,,,,,,,,,,,,0,,,,,L,landes,,,967,3.462301,45.452461
2021-1071570,2021-07-30,000001,Vente,143010,,,CHOVET,B048,63580,63328,Sainte-Catherine,63,,,633280000C0124,,,,,,,,,,,,,0,,,,,L,landes,,,1484,3.461771,45.452515
2021-1071570,2021-07-30,000001,Vente,143010,,,CHATEAUNEUF,B045,63580,63328,Sainte-Catherine,63,,,633280000C0125,,,,,,,,,,,,,0,,,,,PA,pâtures,,,666,3.461992,45.452771
2021-1071570,2021-07-30,000001,Vente,143010,,,CHATEAUNEUF,B045,63580,63328,Sainte-Catherine,63,,,633280000C0126,,,,,,,,,,,,,0,,,,,L,landes,,,501,3.462229,45.452829
2021-1071570,2021-07-30,000001,Vente,143010,,,CHATEAUNEUF,B045,63580,63328,Sainte-Catherine,63,,,633280000C0127,,,,,,,,,,,,,0,,,,,L,landes,,,240,3.462403,45.452669
2021-1071570,2021-07-30,000001,Vente,143010,5009,,CHATEAUNEUF,B045,63580,63328,Sainte-Catherine,63,,,633280000C0128,,,,,,,,,,,,,0,3,Dépendance,,0,S,sols,,,352,3.462743,45.452708
2021-1071570,2021-07-30,000001,Vente,143010,5009,,CHATEAUNEUF,B045,63580,63328,Sainte-Catherine,63,,,633280000C0128,,,,,,,,,,,,,0,1,Maison,68,3,S,sols,,,352,3.462743,45.452708
2021-1071570,2021-07-30,000001,Vente,143010,,,CHATEAUNEUF,B045,63580,63328,Sainte-Catherine,63,,,633280000C0129,,,,,,,,,,,,,0,,,,,S,sols,,,208,3.463053,45.45269
2021-1071570,2021-07-30,000001,Vente,143010,,,CHATEAUNEUF,B045,63580,63328,Sainte-Catherine,63,,,633280000C0130,,,,,,,,,,,,,0,,,,,PA,pâtures,,,5595,3.463398,45.452653
2021-1072143,2021-08-30,000001,Vente,204300,5007,,PINET,B105,63580,63328,Sainte-Catherine,63,,,633280000C0332,,,,,,,,,,,,,0,1,Maison,250,9,S,sols,,,56,3.47333,45.453498
2021-1072143,2021-08-30,000001,Vente,204300,5007,,PINET,B105,63580,63328,Sainte-Catherine,63,,,633280000C0332,,,,,,,,,,,,,0,3,Dépendance,,0,S,sols,,,56,3.47333,45.453498
2021-1072143,2021-08-30,000001,Vente,204300,,,PINET,B105,63580,63328,Sainte-Catherine,63,,,633280000C0333,,,,,,,,,,,,,0,,,,,S,sols,,,310,3.473175,45.453515
2021-1072143,2021-08-30,000001,Vente,204300,,,PINET,B105,63580,63328,Sainte-Catherine,63,,,633280000C0336,,,,,,,,,,,,,0,,,,,P,prés,,,1304,3.472915,45.453447
2021-1072143,2021-08-30,000001,Vente,204300,,,PINET,B105,63580,63328,Sainte-Catherine,63,,,633280000C0336,,,,,,,,,,,,,0,,,,,P,prés,,,1305,3.472915,45.453447
2021-1072143,2021-08-30,000001,Vente,204300,,,PINET,B105,63580,63328,Sainte-Catherine,63,,,633280000C0337,,,,,,,,,,,,,0,,,,,L,landes,,,44,3.473237,45.453313
2021-1073987,2021-10-05,000001,Vente,940.44,,,BUGES DE FARGES,B016,63580,63328,Sainte-Catherine,63,,,633280000A0586,,,,,,,,,,,,,0,,,,,BR,futaies résineuses,,,2908,3.481201,45.456563
2021-1073987,2021-10-05,000001,Vente,940.44,,,LA BISOVE,B008,63580,63328,Sainte-Catherine,63,,,633280000A0714,,,,,,,,,,,,,0,,,,,BR,futaies résineuses,,,2352,3.478623,45.456067
2021-1073987,2021-10-05,000001,Vente,940.44,,,LA BISOVE,B008,63580,63328,Sainte-Catherine,63,,,633280000A0724,,,,,,,,,,,,,0,,,,,BR,futaies résineuses,,,5097,3.477909,45.457969
2021-1073987,2021-10-05,000001,Vente,940.44,,,LA BISOVE,B008,63580,63328,Sainte-Catherine,63,,,633280000A0727,,,,,,,,,,,,,0,,,,,BR,futaies résineuses,,,634,3.478136,45.458349
2021-1073987,2021-10-05,000001,Vente,940.44,,,LA BARTE,B003,63580,63328,Sainte-Catherine,63,,,633280000A0737,,,,,,,,,,,,,0,,,,,BR,futaies résineuses,,,1109,3.47842,45.458543
2021-1073987,2021-10-05,000001,Vente,940.44,,,CHAMP DE LA VOISSIERE,B024,63580,63328,Sainte-Catherine,63,,,633280000A0772,,,,,,,,,,,,,0,,,,,BT,taillis simples,,,1223,3.472928,45.457651
2021-1073987,2021-10-05,000001,Vente,940.44,,,CHAMP DE LA VOISSIERE,B024,63580,63328,Sainte-Catherine,63,,,633280000A0775,,,,,,,,,,,,,0,,,,,BR,futaies résineuses,,,2186,3.473363,45.458116
2021-1081344,2021-02-17,000001,Vente,40000,,,FARGES,B165,63580,63328,Sainte-Catherine,63,,,633280000A0370,,,,,,,,,,,,,0,,,,,S,sols,,,920,3.48159,45.459737
2021-1081344,2021-02-17,000001,Vente,40000,,,FARGES,B165,63580,63328,Sainte-Catherine,63,,,633280000A0371,,,,,,,,,,,,,0,,,,,S,sols,,,958,3.481958,45.459768
2021-1081344,2021-02-17,000001,Vente,40000,,,FARGES,B165,63580,63328,Sainte-Catherine,63,,,633280000A0913,,,,,,,,,,,,,0,,,,,S,sols,,,445,3.482173,45.459782
2021-1081344,2021-02-17,000001,Vente,40000,,,FARGES,B165,63580,63328,Sainte-Catherine,63,,,633280000A0916,,,,,,,,,,,,,0,,,,,S,sols,,,301,3.481984,45.459614
2021-1081672,2021-04-08,000001,Vente,7800,,,CHABRANDE,B018,63580,63328,Sainte-Catherine,63,,,633280000A0498,,,,,,,,,,,,,0,,,,,T,terres,,,1515,3.492635,45.457873
2021-1081672,2021-04-08,000001,Vente,7800,,,CHABRANDE,B018,63580,63328,Sainte-Catherine,63,,,633280000A0499,,,,,,,,,,,,,0,,,,,PA,pâtures,,,633,3.492579,45.457643
2021-1081673,2021-03-31,000001,Vente,30000,5055,,LE FOURNIAL,B073,63580,63328,Sainte-Catherine,63,,,633280000A0537,,,,,,,,,,,,,0,3,Dépendance,,0,S,sols,,,351,3.488001,45.452853
