id_mutation,date_mutation,numero_disposition,nature_mutation,valeur_fonciere,adresse_numero,adresse_suffixe,adresse_nom_voie,adresse_code_voie,code_postal,code_commune,nom_commune,code_departement,ancien_code_commune,ancien_nom_commune,id_parcelle,ancien_id_parcelle,numero_volume,lot1_numero,lot1_surface_carrez,lot2_numero,lot2_surface_carrez,lot3_numero,lot3_surface_carrez,lot4_numero,lot4_surface_carrez,lot5_numero,lot5_surface_carrez,nombre_lots,code_type_local,type_local,surface_reelle_bati,nombre_pieces_principales,code_nature_culture,nature_culture,code_nature_culture_speciale,nature_culture_speciale,surface_terrain,longitude,latitude
2021-1063638,2021-02-05,000001,Vente,15000,,,CHAMP DE LA GRANGE,B100,63470,63450,Verneugheol,63,,,634500000F0399,,,,,,,,,,,,,0,,,,,P,prés,,,1360,,
2021-1063638,2021-02-05,000001,Vente,15000,,,CHATONNIER,B140,63470,63450,Verneugheol,63,,,634500000F0400,,,,,,,,,,,,,0,,,,,L,landes,,,310,2.513802,45.725721
2021-1063638,2021-02-05,000001,Vente,15000,5154,,CHATONNIER,B140,63470,63450,Verneugheol,63,,,634500000F0401,,,,,,,,,,,,,0,1,Maison,90,4,S,sols,,,320,2.513783,45.72554
2021-1063638,2021-02-05,000001,Vente,15000,,,CHATONNIER,B140,63470,63450,Verneugheol,63,,,634500000F0402,,,,,,,,,,,,,0,,,,,S,sols,,,40,2.513553,45.725607
2021-1063638,2021-02-05,000001,Vente,15000,,,PRE DU JARDIN,B518,63470,63450,Verneugheol,63,,,634500000F0407,,,,,,,,,,,,,0,,,,,P,prés,,,2120,2.513274,45.725645
2021-1065775,2021-05-03,000001,Vente,2622,,,LES COURADES,B202,63470,63450,Verneugheol,63,,,634500000D0078,,,,,,,,,,,,,0,,,,,T,terres,,,6180,2.481981,45.760112
2021-1065775,2021-05-03,000001,Vente,2622,,,COUSSAT,B205,63470,63450,Verneugheol,63,,,634500000D0086,,,,,,,,,,,,,0,,,,,P,prés,,,720,2.482948,45.759779
2021-1067493,2021-06-11,000001,Vente,21000,,,COUSSAT,B205,63470,63450,Verneugheol,63,,,634500000D0102,,,,,,,,,,,,,0,,,,,S,sols,,,35,2.483736,45.759519
2021-1067493,2021-06-11,000001,Vente,21000,,,COUSSAT,B205,63470,63450,Verneugheol,63,,,634500000D0656,,,,,,,,,,,,,0,,,,,S,sols,,,154,2.483825,45.759824
2021-1067493,2021-06-11,000001,Vente,21000,5099,,COUSSAT,B205,63470,63450,Verneugheol,63,,,634500000D0657,,,,,,,,,,,,,0,3,Dépendance,,0,S,sols,,,56,2.483783,45.759732
2021-1067493,2021-06-11,000001,Vente,21000,5099,,COUSSAT,B205,63470,63450,Verneugheol,63,,,634500000D0657,,,,,,,,,,,,,0,1,Maison,42,1,S,sols,,,56,2.483783,45.759732
2021-1067493,2021-06-11,000001,Vente,21000,,,COUSSAT,B205,63470,63450,Verneugheol,63,,,634500000D0659,,,,,,,,,,,,,0,,,,,S,sols,,,21,2.483912,45.759662
2021-1067941,2021-06-02,000001,Vente,500,,,PETIT PATURAL,B441,63470,63450,Verneugheol,63,,,634500000F0292,,,,,,,,,,,,,0,,,,,BT,taillis simples,,,1910,2.503988,45.728111
2021-1067941,2021-06-02,000001,Vente,500,,,PETIT PATURAL,B441,63470,63450,Verneugheol,63,,,634500000F0292,,,,,,,,,,,,,0,,,,,BR,futaies résineuses,,,1910,2.503988,45.728111
2021-1067941,2021-06-02,000001,Vente,500,,,CHAMP DE LA GRANGE,B100,63470,63450,Verneugheol,63,,,634500000F0396,,,,,,,,,,,,,0,,,,,P,prés,,,1200,2.514724,45.725794
2021-1068611,2021-06-25,000001,Vente,37220,5014,,CHASSIGNOL,B138,63470,63450,Verneugheol,63,,,63450000AB0023,,,,,,,,,,,,,0,1,Maison,142,5,S,sols,,,205,2.539489,45.784517
2021-1068611,2021-06-25,000001,Vente,37220,5014,,CHASSIGNOL,B138,63470,63450,Verneugheol,63,,,63450000AB0023,,,,,,,,,,,,,0,3,Dépendance,,0,S,sols,,,205,2.539489,45.784517
2021-1069322,2021-06-25,000001,Vente,75000,,,RIBIERAS,B560,63470,63450,Verneugheol,63,,,634500000F0174,,,,,,,,,,,,,0,,,,,S,sols,,,70,2.495916,45.744965
2021-1069322,2021-06-25,000001,Vente,75000,,,RIBIERAS,B560,63470,63450,Verneugheol,63,,,634500000F0647,,,,,,,,,,,,,0,,,,,S,sols,,,180,2.495988,45.745195
2021-1069322,2021-06-25,000001,Vente,75000,5131,,RIBIERAS,B560,63470,63450,Verneugheol,63,,,634500000F0697,,,,,,,,,,,,,0,3,Dépendance,,0,S,sols,,,323,2.495884,45.745233
2021-1069322,2021-06-25,000001,Vente,75000,5131,,RIBIERAS,B560,63470,63450,Verneugheol,63,,,634500000F0697,,,,,,,,,,,,,0,1,Maison,70,4,S,sols,,,323,2.495884,45.745233
2021-1069322,2021-06-25,000001,Vente,75000,,,RIBIERAS,B560,63470,63450,Verneugheol,63,,,634500000F0699,,,,,,,,,,,,,0,,,,,S,sols,,,83,2.496031,45.74528
2021-1070459,2021-07-13,000002,Echange,60,,,CHAMP DE LA GRANGE,B100,63470,63450,Verneugheol,63,,,634500000F0744,,,,,,,,,,,,,0,,,,,P,prés,,,305,2.514379,45.726046
2021-1070459,2021-07-13,000003,Echange,60,,,CHAMP DE LA GRANGE,B100,63470,63450,Verneugheol,63,,,634500000F0743,,,,,,,,,,,,,0,,,,,P,prés,,,305,2.514026,45.726083
2021-1075337,2021-10-15,000001,Vente,1400,,,SAGNE DU MOULIN,B581,63470,63450,Verneugheol,63,,,63450000AB0134,,,,,,,,,,,,,0,,,,,BR,futaies résineuses,,,13205,2.551932,45.776529
2021-1076655,2021-11-15,000001,Vente,12255,,,LES CUTAIX,B220,63470,63450,Verneugheol,63,,,634500000A0012,,,,,,,,,,,,,0,,,,,T,terres,,,4580,2.520499,45.78296
2021-1076655,2021-11-15,000001,Vente,12255,,,BUGES DE LA FONT,B081,63470,63450,Verneugheol,63,,,634500000A0030,,,,,,,,,,,,,0,,,,,T,terres,,,14110,2.523541,45.785381
2021-1076655,2021-11-15,000001,Vente,12255,,,PRE DE LA FONT,B501,63470,63450,Verneugheol,63,,,634500000A0031,,,,,,,,,,,,,0,,,,,P,prés,,,4248,2.524179,45.784749
2021-1076655,2021-11-15,000001,Vente,12255,,,PRALINTE,B479,63470,63450,Verneugheol,63,,,634500000A0079,,,,,,,,,,,,,0,,,,,P,prés,,,1920,2.524773,45.781713
2021-1076655,2021-11-15,000001,Vente,12255,,,PRALINTE,B479,63470,63450,Verneugheol,63,,,634500000A0080,,,,,,,,,,,,,0,,,,,P,prés,,,4922,2.524967,45.78213
2021-1076655,2021-11-15,000001,Vente,12255,,,GRAND PRE,B319,63470,63450,Verneugheol,63,,,634500000A0094,,,,,,,,,,,,,0,,,,,P,prés,,,5700,2.52602,45.782802
2021-1076655,2021-11-15,000001,Vente,12255,,,LE JETTON,B346,63470,63450,Verneugheol,63,,,634500000A0137,,,,,,,,,,,,,0,,,,,BR,futaies résineuses,,,7096,2.528632,45.788839
2021-1076655,2021-11-15,000001,Vente,12255,,,LE COMMUNAL,B176,63470,63450,Verneugheol,63,,,634500000A0201,,,,,,,,,,,,,0,,,,,T,terres,,,6540,2.529921,45.779338
2021-1076655,2021-11-15,000001,Vente,12255,,,LES CUBES,B219,63470,63450,Verneugheol,63,,,634500000A0283,,,,,,,,,,,,,0,,,,,T,terres,,,7421,2.522806,45.780245
2021-1076655,2021-11-15,000001,Vente,12255,,,LES CUBES,B219,63470,63450,Verneugheol,63,,,634500000A0283,,,,,,,,,,,,,0,,,,,T,terres,,,7422,2.522806,45.780245
2021-1076655,2021-11-15,000001,Vente,12255,,,LE PONT,B462,63470,63450,Verneugheol,63,,,634500000A0294,,,,,,,,,,,,,0,,,,,PA,pâtures,,,914,2.524283,45.779968
2021-1076655,2021-11-15,000001,Vente,12255,,,LE PONT,B462,63470,63450,Verneugheol,63,,,634500000A0296,,,,,,,,,,,,,0,,,,,PA,pâtures,,,5143,2.525769,45.779802
2021-1076655,2021-11-15,000001,Vente,12255,,,CRESSENSSAT,B208,63470,63450,Verneugheol,63,,,634500000A0306,,,,,,,,,,,,,0,,,,,S,sols,,,108,2.52379,45.783227
2021-1076655,2021-11-15,000001,Vente,12255,,,LES CUBES,B219,63470,63450,Verneugheol,63,,,634500000A0331,,,,,,,,,,,,,0,,,,,T,terres,,,1200,2.522731,45.780946
2021-1076655,2021-11-15,000001,Vente,12255,,,CHAMP DU FOUR,B114,63470,63450,Verneugheol,63,,,634500000A0367,,,,,,,,,,,,,0,,,,,P,prés,,,6855,2.524867,45.783668
2021-1076655,2021-11-15,000001,Vente,12255,,,FONT DOVY,B266,63470,63450,Verneugheol,63,,,634500000B0028,,,,,,,,,,,,,0,,,,,PA,pâtures,,,770,2.52628,45.779482
2021-1076655,2021-11-15,000001,Vente,12255,,,BOURG DE VERNEUGHEOL,B640,63470,63450,Verneugheol,63,,,634500000B0542,,,,,,,,,,,,,0,,,,,PA,pâtures,,,5227,2.524892,45.779207
2021-1076655,2021-11-15,000001,Vente,12255,,,FONT DOVY,B266,63470,63450,Verneugheol,63,,,634500000B0544,,,,,,,,,,,,,0,,,,,PA,pâtures,,,4193,2.525493,45.779631
2021-1078069,2021-12-10,000001,Vente,114000,,,LA GARDE,B294,63470,63450,Verneugheol,63,,,634500000C0204,,,,,,,,,,,,,0,,,,,BR,futaies résineuses,,,2400,2.519661,45.751654
2021-1078069,2021-12-10,000001,Vente,114000,,,LE VILLAGE,B642,63470,63450,Verneugheol,63,,,634500000C0205,,,,,,,,,,,,,0,,,,,J,jardins,,,2715,2.519988,45.752312
2021-1078069,2021-12-10,000001,Vente,114000,,,LE VILLAGE,B642,63470,63450,Verneugheol,63,,,634500000C0205,,,,,,,,,,,,,0,,,,,S,sols,,,500,2.519988,45.752312
2021-1078069,2021-12-10,000001,Vente,114000,5120,,LE VILLAGE,B642,63470,63450,Verneugheol,63,,,634500000C0206,,,,,,,,,,,,,0,1,Maison,118,5,S,sols,,,275,2.520217,45.752447
2021-1078069,2021-12-10,000001,Vente,114000,5120,,LE VILLAGE,B642,63470,63450,Verneugheol,63,,,634500000C0206,,,,,,,,,,,,,0,3,Dépendance,,0,S,sols,,,275,2.520217,45.752447
2021-1078707,2021-12-21,000002,Vente,80000,5138,,LA NERIE,B395,63470,63450,Verneugheol,63,,,63450000AI0082,,,,,,,,,,,,,0,1,Maison,98,4,S,sols,,,319,2.539998,45.743541
2021-1078707,2021-12-21,000002,Vente,80000,,,LA NERIE,B395,63470,63450,Verneugheol,63,,,63450000AI0083,,,,,,,,,,,,,0,,,,,S,sols,,,148,2.540366,45.743353
2021-1078707,2021-12-21,000002,Vente,80000,,,LE COUDERT,B194,63470,63450,Verneugheol,63,,,63450000AI0209,,,,,,,,,,,,,0,,,,,S,sols,,,417,2.540278,45.743456
2021-1078707,2021-12-21,000002,Vente,80000,,,LE COUDERT,B194,63470,63450,Verneugheol,63,,,63450000AI0283,,,,,,,,,,,,,0,,,,,PA,pâtures,,,583,2.540036,45.743477
2021-1078707,2021-12-21,000002,Vente,80000,,,LE COUDERT,B194,63470,63450,Verneugheol,63,,,63450000AI0284,,,,,,,,,,,,,0,,,,,PA,pâtures,,,57,2.540272,45.743256
