id_mutation,date_mutation,numero_disposition,nature_mutation,valeur_fonciere,adresse_numero,adresse_suffixe,adresse_nom_voie,adresse_code_voie,code_postal,code_commune,nom_commune,code_departement,ancien_code_commune,ancien_nom_commune,id_parcelle,ancien_id_parcelle,numero_volume,lot1_numero,lot1_surface_carrez,lot2_numero,lot2_surface_carrez,lot3_numero,lot3_surface_carrez,lot4_numero,lot4_surface_carrez,lot5_numero,lot5_surface_carrez,nombre_lots,code_type_local,type_local,surface_reelle_bati,nombre_pieces_principales,code_nature_culture,nature_culture,code_nature_culture_speciale,nature_culture_speciale,surface_terrain,longitude,latitude
2021-1103963,2021-02-08,000002,Vente,55000,,,CRAMPETTES,B016,65400,65021,Arcizans-Avant,65,,,650210000A0109,,,,,,,,,,,,,0,,,,,P,prés,,,3790,-0.106322,42.994346
2021-1103963,2021-02-08,000002,Vente,55000,,,CRAMPETTES,B016,65400,65021,Arcizans-Avant,65,,,650210000A0110,,,,,,,,,,,,,0,,,,,L,landes,PATUR,Pâture plantée,2015,-0.106202,42.994572
2021-1103963,2021-02-08,000002,Vente,55000,,,CRAMPETTES,B016,65400,65021,Arcizans-Avant,65,,,650210000A0113,,,,,,,,,,,,,0,,,,,L,landes,PATUR,Pâture plantée,13055,-0.106924,42.994802
2021-1103963,2021-02-08,000002,Vente,55000,,,CRAMPETTES,B016,65400,65021,Arcizans-Avant,65,,,650210000A0114,,,,,,,,,,,,,0,,,,,S,sols,,,91,-0.10773,42.994629
2021-1103963,2021-02-08,000002,Vente,55000,,,CRAMPETTES,B016,65400,65021,Arcizans-Avant,65,,,650210000A1077,,,,,,,,,,,,,0,,,,,P,prés,,,1671,-0.106175,42.993994
2021-1104396,2021-03-05,000001,Vente,2000,,,POUYDARRE,B033,65400,65021,Arcizans-Avant,65,,,650210000B0734,,,,,,,,,,,,,0,,,,,L,landes,PATUR,Pâture plantée,3506,-0.107893,42.983713
2021-1105898,2021-05-28,000001,Vente,379000,,,BARDERON,B005,65400,65021,Arcizans-Avant,65,,,650210000A0711,,,,,,,,,,,,,0,,,,,S,sols,,,40,-0.097515,42.990654
2021-1105898,2021-05-28,000001,Vente,379000,8,,CAMI DE BARDERON,0003,65400,65021,Arcizans-Avant,65,,,650210000A0712,,,,,,,,,,,,,0,3,Dépendance,,0,S,sols,,,160,-0.097522,42.990566
2021-1106391,2021-06-10,000001,Vente,4500,,,COUMETS,B014,65400,65021,Arcizans-Avant,65,,,650210000B0249,,,,,,,,,,,,,0,,,,,S,sols,,,96,-0.112281,42.97523
2021-1106391,2021-06-10,000001,Vente,4500,,,COUMETS,B014,65400,65021,Arcizans-Avant,65,,,650210000B0250,,,,,,,,,,,,,0,,,,,L,landes,PATUR,Pâture plantée,10500,-0.112717,42.975406
2021-1106814,2021-06-29,000001,Vente,250200,12,,CAMI DERA MONTANHA,0055,65400,65021,Arcizans-Avant,65,,,650210000B0518,,,,,,,,,,,,,0,1,Maison,126,4,S,sols,,,500,-0.110732,42.984808
2021-1106814,2021-06-29,000001,Vente,250200,12,,CAMI DERA MONTANHA,0055,65400,65021,Arcizans-Avant,65,,,650210000B0518,,,,,,,,,,,,,0,1,Maison,126,4,P,prés,,,704,-0.110732,42.984808
2021-1107377,2021-07-28,000001,Vente,120000,39,,CAMI D AZUN,0002,65400,65021,Arcizans-Avant,65,,,650210000B0491,,,,,,,,,,,,,0,3,Dépendance,,0,S,sols,,,1000,-0.111146,42.98616
2021-1107377,2021-07-28,000001,Vente,120000,39,,CAMI D AZUN,0002,65400,65021,Arcizans-Avant,65,,,650210000B0491,,,,,,,,,,,,,0,3,Dépendance,,0,S,sols,,,1000,-0.111146,42.98616
2021-1107377,2021-07-28,000001,Vente,120000,39,,CAMI D AZUN,0002,65400,65021,Arcizans-Avant,65,,,650210000B0491,,,,,,,,,,,,,0,1,Maison,133,5,S,sols,,,1000,-0.111146,42.98616
2021-1107377,2021-07-28,000001,Vente,120000,39,,CAMI D AZUN,0002,65400,65021,Arcizans-Avant,65,,,650210000B0491,,,,,,,,,,,,,0,3,Dépendance,,0,T,terres,,,514,-0.111146,42.98616
2021-1107377,2021-07-28,000001,Vente,120000,39,,CAMI D AZUN,0002,65400,65021,Arcizans-Avant,65,,,650210000B0491,,,,,,,,,,,,,0,3,Dépendance,,0,T,terres,,,514,-0.111146,42.98616
2021-1107377,2021-07-28,000001,Vente,120000,39,,CAMI D AZUN,0002,65400,65021,Arcizans-Avant,65,,,650210000B0491,,,,,,,,,,,,,0,1,Maison,133,5,T,terres,,,514,-0.111146,42.98616
2021-1107848,2021-08-04,000001,Vente,250000,,,BIMAROS,B008,65400,65021,Arcizans-Avant,65,,,650210000B0549,,,,,,,,,,,,,0,,,,,AB,terrains a bâtir,,,1486,-0.101901,42.985737
2021-1107848,2021-08-04,000001,Vente,250000,,,BIMAROS,B008,65400,65021,Arcizans-Avant,65,,,650210000B0550,,,,,,,,,,,,,0,,,,,AB,terrains a bâtir,,,1485,-0.101505,42.985603
2021-1108124,2021-09-10,000001,Vente,7500,,,PAOUMOULI,B031,65400,65021,Arcizans-Avant,65,,,650210000B0627,,,,,,,,,,,,,0,,,,,L,landes,PATUR,Pâture plantée,1897,-0.106699,42.97746
2021-1108124,2021-09-10,000001,Vente,7500,,,PAOUMOULI,B031,65400,65021,Arcizans-Avant,65,,,650210000B0629,,,,,,,,,,,,,0,,,,,L,landes,,,13608,-0.107252,42.976844
2021-1108332,2021-09-24,000001,Vente,427542,,,LE BOURG,B009,65400,65021,Arcizans-Avant,65,,,650210000A0983,,,,,,,,,,,,,0,,,,,AB,terrains a bâtir,,,729,-0.104546,42.988618
2021-1108332,2021-09-24,000001,Vente,427542,,,LE BOURG,B009,65400,65021,Arcizans-Avant,65,,,650210000A0984,,,,,,,,,,,,,0,,,,,AB,terrains a bâtir,,,293,-0.104823,42.988739
2021-1108332,2021-09-24,000001,Vente,427542,3,,CAMI DE BROUCA,0007,65400,65021,Arcizans-Avant,65,,,650210000A0987,,,,,,,,,,,,,0,1,Maison,180,4,S,sols,,,429,-0.104979,42.988784
2021-1109037,2021-10-05,000001,Vente,10000,,,LAS BIGNES,B024,65400,65021,Arcizans-Avant,65,,,650210000A0265,,,,,,,,,,,,,0,,,,,T,terres,,,1970,-0.103925,42.989796
2021-1109111,2021-10-28,000001,Vente,1500,,,MAILLO,B027,65400,65021,Arcizans-Avant,65,,,650210000A0790,,,,,,,,,,,,,0,,,,,P,prés,,,61,-0.102824,42.986588
2021-1109112,2021-10-28,000002,Vente,227500,23,,CAMI DE CATIBERE,0035,65400,65021,Arcizans-Avant,65,,,650210000A0783,,,,,,,,,,,,,0,3,Dépendance,,0,S,sols,,,300,-0.102774,42.986741
2021-1109112,2021-10-28,000002,Vente,227500,23,,CAMI DE CATIBERE,0035,65400,65021,Arcizans-Avant,65,,,650210000A0783,,,,,,,,,,,,,0,1,Maison,92,4,S,sols,,,300,-0.102774,42.986741
2021-1109327,2021-11-03,000001,Vente,252450,1,,LOT DU CABALIROS,A008,65400,65021,Arcizans-Avant,65,,,650210000B0337,,,,,,,,,,,,,0,1,Maison,100,3,S,sols,,,610,-0.104209,42.985933
