id_mutation,date_mutation,numero_disposition,nature_mutation,valeur_fonciere,adresse_numero,adresse_suffixe,adresse_nom_voie,adresse_code_voie,code_postal,code_commune,nom_commune,code_departement,ancien_code_commune,ancien_nom_commune,id_parcelle,ancien_id_parcelle,numero_volume,lot1_numero,lot1_surface_carrez,lot2_numero,lot2_surface_carrez,lot3_numero,lot3_surface_carrez,lot4_numero,lot4_surface_carrez,lot5_numero,lot5_surface_carrez,nombre_lots,code_type_local,type_local,surface_reelle_bati,nombre_pieces_principales,code_nature_culture,nature_culture,code_nature_culture_speciale,nature_culture_speciale,surface_terrain,longitude,latitude
2021-1104894,2021-04-16,000001,Vente,338500,25,,RUE DU CLAIR VALLON,0010,65350,65104,Boulin,65,,,651040000B0285,,,,,,,,,,,,,0,1,Maison,207,6,S,sols,,,1000,0.141349,43.250403
2021-1104894,2021-04-16,000001,Vente,338500,25,,RUE DU CLAIR VALLON,0010,65350,65104,Boulin,65,,,651040000B0285,,,,,,,,,,,,,0,1,Maison,207,6,P,prés,,,1730,0.141349,43.250403
2021-1106236,2021-06-18,000001,Vente,240000,26,,RUE DU PIC DU MIDI,0034,65350,65104,Boulin,65,,,651040000B0299,,,,,,,,,,,,,0,1,Maison,160,5,S,sols,,,1018,0.141886,43.252611
2021-1106236,2021-06-18,000001,Vente,240000,26,,RUE DU PIC DU MIDI,0034,65350,65104,Boulin,65,,,651040000B0299,,,,,,,,,,,,,0,1,Maison,160,5,P,prés,,,972,0.141886,43.252611
2021-1106915,2021-07-13,000001,Vente,452900,8,B,RTE DE LA FORET,0015,65350,65104,Boulin,65,,,651040000B0144,,,,,,,,,,,,,0,3,Dépendance,,0,S,sols,,,912,0.136677,43.245539
2021-1106915,2021-07-13,000001,Vente,452900,8,B,RTE DE LA FORET,0015,65350,65104,Boulin,65,,,651040000B0144,,,,,,,,,,,,,0,1,Maison,252,7,S,sols,,,912,0.136677,43.245539
2021-1106915,2021-07-13,000001,Vente,452900,,,LAMARTERE,B009,65350,65104,Boulin,65,,,651040000B0344,,,,,,,,,,,,,0,,,,,S,sols,,,99,0.134879,43.245851
2021-1106915,2021-07-13,000001,Vente,452900,,,LAMARTERE,B009,65350,65104,Boulin,65,,,651040000B0393,,,,,,,,,,,,,0,,,,,S,sols,,,238,0.135534,43.245641
2021-1106915,2021-07-13,000001,Vente,452900,,,LAMARTERE,B009,65350,65104,Boulin,65,,,651040000B0395,,,,,,,,,,,,,0,,,,,S,sols,,,133,0.135168,43.245744
2021-1106915,2021-07-13,000001,Vente,452900,,,LAMARTERE,B009,65350,65104,Boulin,65,,,651040000B0397,,,,,,,,,,,,,0,,,,,S,sols,,,274,0.136176,43.245533
2021-1106915,2021-07-13,000001,Vente,452900,,,LAMARTERE,B009,65350,65104,Boulin,65,,,651040000B0398,,,,,,,,,,,,,0,,,,,S,sols,,,351,0.136664,43.245434
2021-1106915,2021-07-13,000001,Vente,452900,,,LAMARIGUE,B008,65350,65104,Boulin,65,,,651040000B0400,,,,,,,,,,,,,0,,,,,P,prés,,,162,0.136862,43.24569
2021-1106915,2021-07-13,000001,Vente,452900,,,LAMARTERE,B009,65350,65104,Boulin,65,,,651040000B0435,,,,,,,,,,,,,0,,,,,S,sols,,,200,0.136429,43.245412
2021-1106915,2021-07-13,000001,Vente,452900,,,LAMARTERE,B009,65350,65104,Boulin,65,,,651040000B0435,,,,,,,,,,,,,0,,,,,P,prés,,,573,0.136429,43.245412
2021-1106915,2021-07-13,000001,Vente,452900,,,LAMARIGUE,B008,65350,65104,Boulin,65,,,651040000B0446,,,,,,,,,,,,,0,,,,,P,prés,,,300,0.136436,43.245603
2021-1106915,2021-07-13,000001,Vente,452900,,,LAMARIGUE,B008,65350,65104,Boulin,65,,,651040000B0446,,,,,,,,,,,,,0,,,,,S,sols,,,144,0.136436,43.245603
2021-1107650,2021-08-24,000001,Vente,235000,22,,RUE DU PIC DU MIDI,0034,65350,65104,Boulin,65,,,651040000B0048,,,,,,,,,,,,,0,3,Dépendance,,0,J,jardins,,,1170,0.141551,43.253128
2021-1107650,2021-08-24,000001,Vente,235000,22,,RUE DU PIC DU MIDI,0034,65350,65104,Boulin,65,,,651040000B0048,,,,,,,,,,,,,0,3,Dépendance,,0,S,sols,,,1200,0.141551,43.253128
2021-1107650,2021-08-24,000001,Vente,235000,22,,RUE DU PIC DU MIDI,0034,65350,65104,Boulin,65,,,651040000B0048,,,,,,,,,,,,,0,1,Maison,116,5,S,sols,,,1200,0.141551,43.253128
2021-1107650,2021-08-24,000001,Vente,235000,22,,RUE DU PIC DU MIDI,0034,65350,65104,Boulin,65,,,651040000B0048,,,,,,,,,,,,,0,1,Maison,116,5,J,jardins,,,1170,0.141551,43.253128
2021-1109799,2021-11-19,000001,Vente,236970,8,,RUE DU VERT GALANT,0045,65350,65104,Boulin,65,,,651040000B0401,,,,,,,,,,,,,0,1,Maison,115,4,S,sols,,,1000,0.135671,43.252192
2021-1109799,2021-11-19,000001,Vente,236970,8,,RUE DU VERT GALANT,0045,65350,65104,Boulin,65,,,651040000B0401,,,,,,,,,,,,,0,1,Maison,115,4,J,jardins,,,790,0.135671,43.252192
2021-1109799,2021-11-19,000001,Vente,236970,,,LE TURON,B014,65350,65104,Boulin,65,,,651040000B0403,,,,,,,,,,,,,0,,,,,L,landes,,,388,0.135189,43.252159
2021-1109831,2021-11-18,000001,Vente,160000,34,,RUE DU PIC DU MIDI,0034,65350,65104,Boulin,65,,,651040000B0304,,,,,,,,,,,,,0,1,Maison,98,5,S,sols,,,1622,0.142308,43.251602
2021-1110497,2021-12-17,000001,Vente,200000,8,,RTE DE LA FORET,0015,65350,65104,Boulin,65,,,651040000B0447,,,,,,,,,,,,,0,3,Dépendance,,0,P,prés,,,797,0.136032,43.245631
2021-1110497,2021-12-17,000001,Vente,200000,8,,RTE DE LA FORET,0015,65350,65104,Boulin,65,,,651040000B0447,,,,,,,,,,,,,0,1,Maison,128,4,P,prés,,,797,0.136032,43.245631
2021-1110538,2021-12-21,000001,Vente,3820,,,LACOSTE,B005,65350,65104,Boulin,65,,,651040000A0105,,,,,,,,,,,,,0,,,,,BT,taillis simples,,,6013,0.132343,43.261079
2021-1110538,2021-12-21,000001,Vente,3820,,,LACOSTE,B005,65350,65104,Boulin,65,,,651040000A0106,,,,,,,,,,,,,0,,,,,P,prés,,,2294,0.131494,43.260773
2021-1110538,2021-12-21,000001,Vente,3820,,,LACOSTE,B005,65350,65104,Boulin,65,,,651040000A0107,,,,,,,,,,,,,0,,,,,BT,taillis simples,,,864,0.131797,43.261005
2021-1110538,2021-12-21,000001,Vente,3820,,,LACOSTE,B005,65350,65104,Boulin,65,,,651040000A0108,,,,,,,,,,,,,0,,,,,T,terres,,,3736,0.131643,43.261519
2021-1110538,2021-12-21,000001,Vente,3820,,,LACOSTE,B005,65350,65104,Boulin,65,,,651040000A0140,,,,,,,,,,,,,0,,,,,T,terres,,,4530,0.130049,43.261185
2021-1110538,2021-12-21,000001,Vente,3820,,,LACOSTE,B005,65350,65104,Boulin,65,,,651040000A0145,,,,,,,,,,,,,0,,,,,T,terres,,,4745,0.129704,43.25904
