id_mutation,date_mutation,numero_disposition,nature_mutation,valeur_fonciere,adresse_numero,adresse_suffixe,adresse_nom_voie,adresse_code_voie,code_postal,code_commune,nom_commune,code_departement,ancien_code_commune,ancien_nom_commune,id_parcelle,ancien_id_parcelle,numero_volume,lot1_numero,lot1_surface_carrez,lot2_numero,lot2_surface_carrez,lot3_numero,lot3_surface_carrez,lot4_numero,lot4_surface_carrez,lot5_numero,lot5_surface_carrez,nombre_lots,code_type_local,type_local,surface_reelle_bati,nombre_pieces_principales,code_nature_culture,nature_culture,code_nature_culture_speciale,nature_culture_speciale,surface_terrain,longitude,latitude
2021-1103540,2021-02-02,000001,Vente,105000,,,PALANGUES,B058,65300,65150,Clarens,65,,,651500000D0659,,,,,,,,,,,,,0,,,,,T,terres,,,12287,,
2021-1103540,2021-02-02,000001,Vente,105000,,,PALANGUES,B058,65300,65150,Clarens,65,,,651500000D0659,,,,,,,,,,,,,0,,,,,AB,terrains a bâtir,,,2500,,
2021-1103952,2021-02-22,000001,Vente,267500,57,,RTE DE LA LANDE,0035,65300,65150,Clarens,65,,,651500000C0515,,,,,,,,,,,,,0,3,Dépendance,,0,P,prés,,,3426,0.408719,43.14895
2021-1103952,2021-02-22,000001,Vente,267500,57,,RTE DE LA LANDE,0035,65300,65150,Clarens,65,,,651500000C0515,,,,,,,,,,,,,0,3,Dépendance,,0,P,prés,,,3426,0.408719,43.14895
2021-1103952,2021-02-22,000001,Vente,267500,57,,RTE DE LA LANDE,0035,65300,65150,Clarens,65,,,651500000C0515,,,,,,,,,,,,,0,1,Maison,153,6,S,sols,,,500,0.408719,43.14895
2021-1103952,2021-02-22,000001,Vente,267500,57,,RTE DE LA LANDE,0035,65300,65150,Clarens,65,,,651500000C0515,,,,,,,,,,,,,0,3,Dépendance,,0,S,sols,,,500,0.408719,43.14895
2021-1103952,2021-02-22,000001,Vente,267500,57,,RTE DE LA LANDE,0035,65300,65150,Clarens,65,,,651500000C0515,,,,,,,,,,,,,0,3,Dépendance,,0,S,sols,,,500,0.408719,43.14895
2021-1103952,2021-02-22,000001,Vente,267500,57,,RTE DE LA LANDE,0035,65300,65150,Clarens,65,,,651500000C0515,,,,,,,,,,,,,0,1,Maison,153,6,P,prés,,,3426,0.408719,43.14895
2021-1103952,2021-02-22,000001,Vente,267500,57,,RTE DE LA LANDE,0035,65300,65150,Clarens,65,,,651500000C0515,,,,,,,,,,,,,0,3,Dépendance,,0,P,prés,,,3426,0.408719,43.14895
2021-1103952,2021-02-22,000001,Vente,267500,57,,RTE DE LA LANDE,0035,65300,65150,Clarens,65,,,651500000C0515,,,,,,,,,,,,,0,3,Dépendance,,0,S,sols,,,500,0.408719,43.14895
2021-1104723,2021-03-30,000001,Vente,18000,,,LE BOIS,B011,65300,65150,Clarens,65,,,651500000B0058,,,,,,,,,,,,,0,,,,,BT,taillis simples,,,879,0.42375,43.170953
2021-1104723,2021-03-30,000001,Vente,18000,,,LE BOIS,B011,65300,65150,Clarens,65,,,651500000B0059,,,,,,,,,,,,,0,,,,,P,prés,,,2658,0.423414,43.170899
2021-1104723,2021-03-30,000001,Vente,18000,,,LE BOIS,B011,65300,65150,Clarens,65,,,651500000B0060,,,,,,,,,,,,,0,,,,,T,terres,,,5666,0.42261,43.170808
2021-1104723,2021-03-30,000001,Vente,18000,,,LE BOIS,B011,65300,65150,Clarens,65,,,651500000B0061,,,,,,,,,,,,,0,,,,,L,landes,VAGUE,Terrain vague,1158,0.422115,43.170836
2021-1104723,2021-03-30,000001,Vente,18000,,,LE BOIS,B011,65300,65150,Clarens,65,,,651500000B0066,,,,,,,,,,,,,0,,,,,P,prés,,,1983,0.422393,43.169363
2021-1104723,2021-03-30,000001,Vente,18000,,,LE BOIS,B011,65300,65150,Clarens,65,,,651500000B0067,,,,,,,,,,,,,0,,,,,P,prés,,,8591,0.422598,43.168926
2021-1104723,2021-03-30,000001,Vente,18000,,,LAS PACHERES,B048,65300,65150,Clarens,65,,,651500000B0089,,,,,,,,,,,,,0,,,,,L,landes,PACAG,Pacage,2466,0.422001,43.164344
2021-1104723,2021-03-30,000001,Vente,18000,,,LAS PACHERES,B048,65300,65150,Clarens,65,,,651500000B0090,,,,,,,,,,,,,0,,,,,P,prés,,,6051,0.422239,43.163632
2021-1104723,2021-03-30,000001,Vente,18000,,,LAS PACHERES,B048,65300,65150,Clarens,65,,,651500000B0091,,,,,,,,,,,,,0,,,,,P,prés,,,1546,0.422403,43.162925
2021-1104723,2021-03-30,000001,Vente,18000,,,LAS PACHERES,B048,65300,65150,Clarens,65,,,651500000B0092,,,,,,,,,,,,,0,,,,,P,prés,,,1355,0.42239,43.162667
2021-1104723,2021-03-30,000001,Vente,18000,,,LAS PACHERES,B048,65300,65150,Clarens,65,,,651500000B0098,,,,,,,,,,,,,0,,,,,BT,taillis simples,,,839,0.423485,43.160339
2021-1104723,2021-03-30,000001,Vente,18000,,,LAS PACHERES,B048,65300,65150,Clarens,65,,,651500000B0099,,,,,,,,,,,,,0,,,,,P,prés,,,3857,0.422987,43.160546
2021-1104723,2021-03-30,000001,Vente,18000,,,CAUBEYRES,B022,65300,65150,Clarens,65,,,651500000B0358,,,,,,,,,,,,,0,,,,,T,terres,,,5760,0.419366,43.174778
2021-1104723,2021-03-30,000001,Vente,18000,,,CAUBEYRES,B022,65300,65150,Clarens,65,,,651500000B0359,,,,,,,,,,,,,0,,,,,T,terres,,,1641,0.41911,43.175318
2021-1104723,2021-03-30,000001,Vente,18000,,,CAUBEYRES,B022,65300,65150,Clarens,65,,,651500000B0360,,,,,,,,,,,,,0,,,,,P,prés,,,4760,0.419635,43.175094
2021-1104723,2021-03-30,000001,Vente,18000,,,CAUBEYRES,B022,65300,65150,Clarens,65,,,651500000B0361,,,,,,,,,,,,,0,,,,,P,prés,,,4945,0.419786,43.175738
2021-1104723,2021-03-30,000001,Vente,18000,,,BUALA,B015,65300,65150,Clarens,65,,,651500000B0404,,,,,,,,,,,,,0,,,,,T,terres,,,2900,0.417102,43.17339
2021-1104723,2021-03-30,000001,Vente,18000,,,BUALA,B015,65300,65150,Clarens,65,,,651500000B0405,,,,,,,,,,,,,0,,,,,T,terres,,,2218,0.416907,43.173185
2021-1104974,2021-04-16,000002,Vente,23600,,,ENTRE ES CAMIS,B038,65300,65150,Clarens,65,,,651500000C0637,,,,,,,,,,,,,0,,,,,T,terres,,,1139,0.408402,43.148463
2021-1105249,2021-04-28,000001,Vente,69195.2,,,COURTAOU,B031,65300,65150,Clarens,65,,,651500000D0036,,,,,,,,,,,,,0,,,,,T,terres,,,21494,0.423435,43.145456
2021-1105249,2021-04-28,000001,Vente,69195.2,,,COURTAOU,B031,65300,65150,Clarens,65,,,651500000D0037,,,,,,,,,,,,,0,,,,,BT,taillis simples,,,12782,0.423711,43.146428
2021-1105249,2021-04-28,000001,Vente,69195.2,,,COURTAOU,B031,65300,65150,Clarens,65,,,651500000D0038,,,,,,,,,,,,,0,,,,,P,prés,,,10992,0.425276,43.147176
2021-1105249,2021-04-28,000001,Vente,69195.2,,,COURTAOU,B031,65300,65150,Clarens,65,,,651500000D0039,,,,,,,,,,,,,0,,,,,S,sols,,,85,0.4256,43.147281
2021-1105575,2021-05-25,000002,Vente,200000,,,LA COUME,B028,65300,65150,Clarens,65,,,651500000C0561,,,,,,,,,,,,,0,,,,,T,terres,,,719,0.409967,43.156451
2021-1105575,2021-05-25,000002,Vente,200000,,,LA COUME,B028,65300,65150,Clarens,65,,,651500000C0562,,,,,,,,,,,,,0,,,,,T,terres,,,1329,0.409488,43.156639
2021-1105575,2021-05-25,000002,Vente,200000,,,LA COUME,B028,65300,65150,Clarens,65,,,651500000C0640,,,,,,,,,,,,,0,,,,,T,terres,,,2211,0.40894,43.156728
2021-1105575,2021-05-25,000002,Vente,200000,1,,CAMI DE RAMOUN,0050,65300,65150,Clarens,65,,,651500000C0641,,,,,,,,,,,,,0,3,Dépendance,,0,,,,,,0.40878,43.156597
2021-1105575,2021-05-25,000002,Vente,200000,1,,CAMI DE RAMOUN,0050,65300,65150,Clarens,65,,,651500000C0641,,,,,,,,,,,,,0,1,Maison,100,4,,,,,,0.40878,43.156597
2021-1105682,2021-05-26,000001,Vente,15000,,,HONTAGNERES,B043,65300,65150,Clarens,65,,,651500000B0339,,,,,,,,,,,,,0,,,,,T,terres,,,2820,0.41716,43.170135
2021-1105682,2021-05-26,000001,Vente,15000,,,HONTAGNERES,B043,65300,65150,Clarens,65,,,651500000B0760,,,,,,,,,,,,,0,,,,,P,prés,,,33495,0.417257,43.16931
2021-1105990,2021-06-11,000002,Vente,420,,,EL DEHORE DE L ARRIEU,B034,65300,65150,Clarens,65,,,651500000C0629,,,,,,,,,,,,,0,,,,,P,prés,,,108,0.415928,43.155765
2021-1105990,2021-06-11,000002,Vente,420,,,EL DEHORE DE L ARRIEU,B034,65300,65150,Clarens,65,,,651500000C0631,,,,,,,,,,,,,0,,,,,T,terres,,,30,0.415747,43.155755
2021-1106222,2021-06-25,000001,Vente,126500,,,CLOUTETTE,B027,65300,65150,Clarens,65,,,651500000B0167,,,,,,,,,,,,,0,,,,,L,landes,PACAG,Pacage,664,0.413972,43.161822
2021-1106222,2021-06-25,000001,Vente,126500,,,CLOUTETTE,B027,65300,65150,Clarens,65,,,651500000B0168,,,,,,,,,,,,,0,,,,,S,sols,,,1448,0.413747,43.161639
2021-1106222,2021-06-25,000001,Vente,126500,,,CLOUTETTE,B027,65300,65150,Clarens,65,,,651500000B0169,,,,,,,,,,,,,0,,,,,S,sols,,,36,0.413593,43.161747
2021-1106222,2021-06-25,000001,Vente,126500,5,,CLOUTETTE,B027,65300,65150,Clarens,65,,,651500000B0170,,,,,,,,,,,,,0,1,Maison,110,4,S,sols,,,1143,0.413674,43.161379
2021-1106222,2021-06-25,000001,Vente,126500,5,,CLOUTETTE,B027,65300,65150,Clarens,65,,,651500000B0170,,,,,,,,,,,,,0,3,Dépendance,,0,S,sols,,,1143,0.413674,43.161379
2021-1106222,2021-06-25,000001,Vente,126500,,,CLOUTETTE,B027,65300,65150,Clarens,65,,,651500000B0171,,,,,,,,,,,,,0,,,,,J,jardins,,,729,0.41354,43.161241
2021-1106222,2021-06-25,000001,Vente,126500,,,CLOUTETTE,B027,65300,65150,Clarens,65,,,651500000B0171,,,,,,,,,,,,,0,,,,,S,sols,,,31,0.41354,43.161241
2021-1106222,2021-06-25,000001,Vente,126500,,,CLOUTETTE,B027,65300,65150,Clarens,65,,,651500000B0804,,,,,,,,,,,,,0,,,,,S,sols,,,390,0.414179,43.161595
2021-1106222,2021-06-25,000001,Vente,126500,,,CLOUTETTE,B027,65300,65150,Clarens,65,,,651500000B0812,,,,,,,,,,,,,0,,,,,P,prés,,,987,0.41394,43.161278
2021-1106222,2021-06-25,000001,Vente,126500,,,CLOUTETTE,B027,65300,65150,Clarens,65,,,651500000B0812,,,,,,,,,,,,,0,,,,,S,sols,,,130,0.41394,43.161278
2021-1106538,2021-06-25,000002,Vente,26000,,,LANDE DET DEHAURE,B045,65300,65150,Clarens,65,,,651500000D0721,,,,,,,,,,,,,0,,,,,T,terres,,,1000,0.406321,43.139079
2021-1106775,2021-07-09,000001,Vente,4500,,,BALESTE,B005,65300,65150,Clarens,65,,,651500000D0372,,,,,,,,,,,,,0,,,,,BT,taillis simples,,,11786,0.414391,43.129045
2021-1106878,2021-07-12,000002,Vente,169560,7,,MOUTE,B057,65300,65150,Clarens,65,,,651500000B0248,,,,,,,,,,,,,0,1,Maison,162,6,S,sols,,,725,0.415906,43.16249
2021-1106878,2021-07-12,000002,Vente,169560,7,,MOUTE,B057,65300,65150,Clarens,65,,,651500000B0248,,,,,,,,,,,,,0,3,Dépendance,,0,S,sols,,,725,0.415906,43.16249
2021-1106878,2021-07-12,000002,Vente,169560,,,L EGLISE,B037,65300,65150,Clarens,65,,,651500000B0814,,,,,,,,,,,,,0,,,,,J,jardins,,,516,0.416199,43.162611
2021-1106878,2021-07-12,000002,Vente,169560,,,L EGLISE,B037,65300,65150,Clarens,65,,,651500000B0817,,,,,,,,,,,,,0,,,,,S,sols,,,205,0.416066,43.162666
2021-1106878,2021-07-12,000002,Vente,169560,,,L EGLISE,B037,65300,65150,Clarens,65,,,651500000B0819,,,,,,,,,,,,,0,,,,,P,prés,,,733,0.416077,43.162364
2021-1107403,2021-07-30,000001,Vente,33000,,,PUYOULET,B066,65300,65150,Clarens,65,,,651500000A0665,,,,,,,,,,,,,0,,,,,T,terres,,,6460,0.406764,43.147264
2021-1108080,2021-09-08,000002,Vente,43000,,,LUGARDOS,B053,65300,65150,Clarens,65,,,651500000A0837,,,,,,,,,,,,,0,,,,,T,terres,,,2499,0.406697,43.144274
2021-1108987,2021-10-19,000001,Vente,20000,5001,,L ARRIEU,B003,65300,65150,Clarens,65,,,651500000C0438,,,,,,,,,,,,,0,1,Maison,45,3,T,terres,,,1494,0.418225,43.158627
2021-1109291,2021-10-21,000001,Vente,1000,,,LA SERRE,B068,65300,65150,Clarens,65,,,651500000A0235,,,,,,,,,,,,,0,,,,,T,terres,,,3700,0.411285,43.175115
2021-1109920,2021-11-23,000001,Vente,2000,,,MOUSQUEROLE,B056,65300,65150,Clarens,65,,,651500000D0073,,,,,,,,,,,,,0,,,,,L,landes,PACAG,Pacage,4870,0.42887,43.154896
2021-1109931,2021-11-23,000001,Vente,1000,,,CAP DE LA COUME DE LA MATT,B020,65300,65150,Clarens,65,,,651500000B0446,,,,,,,,,,,,,0,,,,,T,terres,,,3037,0.413466,43.174776
2021-1109947,2021-11-27,000001,Vente,1600,,,LA SERRE,B068,65300,65150,Clarens,65,,,651500000A0253,,,,,,,,,,,,,0,,,,,T,terres,,,2600,0.41024,43.171634
2021-1109947,2021-11-27,000001,Vente,1600,,,CAP DE LA COUME DE LA MATT,B020,65300,65150,Clarens,65,,,651500000B0432,,,,,,,,,,,,,0,,,,,T,terres,,,2401,0.414925,43.174281
2021-1110595,2021-12-18,000001,Vente,6000,,,DARRE PUJOS,B033,65300,65150,Clarens,65,,,651500000A0607,,,,,,,,,,,,,0,,,,,T,terres,,,4308,0.40105,43.137475
2021-1110688,2021-12-28,000001,Vente,75000,,,HORT ACHOUE,B044,65300,65150,Clarens,65,,,651500000B0003,,,,,,,,,,,,,0,,,,,T,terres,,,608,0.422309,43.179317
2021-1110688,2021-12-28,000001,Vente,75000,,,HORT ACHOUE,B044,65300,65150,Clarens,65,,,651500000B0014,,,,,,,,,,,,,0,,,,,P,prés,,,3185,0.423873,43.179556
2021-1110688,2021-12-28,000001,Vente,75000,,,HORT ACHOUE,B044,65300,65150,Clarens,65,,,651500000B0016,,,,,,,,,,,,,0,,,,,BT,taillis simples,,,3340,0.42384,43.177725
2021-1110688,2021-12-28,000001,Vente,75000,,,HORT ACHOUE,B044,65300,65150,Clarens,65,,,651500000B0824,,,,,,,,,,,,,0,,,,,T,terres,,,6096,0.424513,43.178556
2021-1110688,2021-12-28,000001,Vente,75000,,,HORT ACHOUE,B044,65300,65150,Clarens,65,,,651500000B0826,,,,,,,,,,,,,0,,,,,S,sols,,,324,0.42328,43.179957
2021-1110688,2021-12-28,000001,Vente,75000,,,HORT ACHOUE,B044,65300,65150,Clarens,65,,,651500000B0829,,,,,,,,,,,,,0,,,,,S,sols,,,84,0.42332,43.17975
2021-1110688,2021-12-28,000001,Vente,75000,,,HORT ACHOUE,B044,65300,65150,Clarens,65,,,651500000B0831,,,,,,,,,,,,,0,,,,,S,sols,,,66,0.422873,43.179655
2021-1110688,2021-12-28,000001,Vente,75000,60,,RTE DE GALAN,0030,65300,65150,Clarens,65,,,651500000B0832,,,,,,,,,,,,,0,1,Maison,119,3,S,sols,,,630,0.423017,43.179893
2021-1110688,2021-12-28,000001,Vente,75000,60,,RTE DE GALAN,0030,65300,65150,Clarens,65,,,651500000B0832,,,,,,,,,,,,,0,3,Dépendance,,0,S,sols,,,630,0.423017,43.179893
2021-1110688,2021-12-28,000001,Vente,75000,60,,RTE DE GALAN,0030,65300,65150,Clarens,65,,,651500000B0832,,,,,,,,,,,,,0,3,Dépendance,,0,S,sols,,,630,0.423017,43.179893
2021-1110688,2021-12-28,000001,Vente,75000,60,,RTE DE GALAN,0030,65300,65150,Clarens,65,,,651500000B0832,,,,,,,,,,,,,0,3,Dépendance,,0,S,sols,,,630,0.423017,43.179893
2021-1110688,2021-12-28,000001,Vente,75000,,,HORT ACHOUE,B044,65300,65150,Clarens,65,,,651500000B0834,,,,,,,,,,,,,0,,,,,S,sols,,,166,0.423306,43.17983
2021-1110688,2021-12-28,000001,Vente,75000,,,HORT ACHOUE,B044,65300,65150,Clarens,65,,,651500000B0835,,,,,,,,,,,,,0,,,,,S,sols,,,88,0.423242,43.179849
2021-1110692,2021-12-28,000003,Vente,55000,,,HORT ACHOUE,B044,65300,65150,Clarens,65,,,651500000B0009,,,,,,,,,,,,,0,,,,,T,terres,,,4044,0.423871,43.180611
2021-1110692,2021-12-28,000003,Vente,55000,,,HORT ACHOUE,B044,65300,65150,Clarens,65,,,651500000B0515,,,,,,,,,,,,,0,,,,,T,terres,,,4036,0.424063,43.180979
2021-1110692,2021-12-28,000003,Vente,55000,,,HORT ACHOUE,B044,65300,65150,Clarens,65,,,651500000B0693,,,,,,,,,,,,,0,,,,,L,landes,VAGUE,Terrain vague,207,0.423484,43.180338
2021-1110692,2021-12-28,000003,Vente,55000,,,HORT ACHOUE,B044,65300,65150,Clarens,65,,,651500000B0697,,,,,,,,,,,,,0,,,,,P,prés,,,1073,0.423373,43.180289
2021-1110692,2021-12-28,000003,Vente,55000,,,HORT ACHOUE,B044,65300,65150,Clarens,65,,,651500000B0699,,,,,,,,,,,,,0,,,,,P,prés,,,3674,0.424172,43.180114
2021-1110692,2021-12-28,000003,Vente,55000,,,HORT ACHOUE,B044,65300,65150,Clarens,65,,,651500000B0700,,,,,,,,,,,,,0,,,,,S,sols,,,62,0.423674,43.179901
2021-1110692,2021-12-28,000003,Vente,55000,,,HORT ACHOUE,B044,65300,65150,Clarens,65,,,651500000B0827,,,,,,,,,,,,,0,,,,,S,sols,,,90,0.423483,43.179962
2021-1110692,2021-12-28,000003,Vente,55000,,,HORT ACHOUE,B044,65300,65150,Clarens,65,,,651500000B0828,,,,,,,,,,,,,0,,,,,S,sols,,,114,0.423656,43.179821
2021-1110692,2021-12-28,000003,Vente,55000,,,HORT ACHOUE,B044,65300,65150,Clarens,65,,,651500000B0831,,,,,,,,,,,,,0,,,,,S,sols,,,66,0.422873,43.179655
2021-1110692,2021-12-28,000003,Vente,55000,60,,RTE DE GALAN,0030,65300,65150,Clarens,65,,,651500000B0832,,,,,,,,,,,,,0,3,Dépendance,,0,S,sols,,,630,0.423017,43.179893
2021-1110692,2021-12-28,000003,Vente,55000,60,,RTE DE GALAN,0030,65300,65150,Clarens,65,,,651500000B0832,,,,,,,,,,,,,0,3,Dépendance,,0,S,sols,,,630,0.423017,43.179893
2021-1110692,2021-12-28,000003,Vente,55000,60,,RTE DE GALAN,0030,65300,65150,Clarens,65,,,651500000B0832,,,,,,,,,,,,,0,1,Maison,119,3,S,sols,,,630,0.423017,43.179893
2021-1110692,2021-12-28,000003,Vente,55000,60,,RTE DE GALAN,0030,65300,65150,Clarens,65,,,651500000B0832,,,,,,,,,,,,,0,3,Dépendance,,0,S,sols,,,630,0.423017,43.179893
2021-1110692,2021-12-28,000003,Vente,55000,,,HORT ACHOUE,B044,65300,65150,Clarens,65,,,651500000B0835,,,,,,,,,,,,,0,,,,,S,sols,,,88,0.423242,43.179849
2021-1110692,2021-12-28,000003,Vente,55000,,,HORT ACHOUE,B044,65300,65150,Clarens,65,,,651500000B0836,,,,,,,,,,,,,0,,,,,S,sols,,,198,0.423555,43.179908
2021-1110698,2021-12-28,000001,Vente,130000,,,HORT ACHOUE,B044,65300,65150,Clarens,65,,,651500000B0002,,,,,,,,,,,,,0,,,,,L,landes,PACAG,Pacage,860,0.422596,43.179955
2021-1110698,2021-12-28,000001,Vente,130000,,,HORT ACHOUE,B044,65300,65150,Clarens,65,,,651500000B0004,,,,,,,,,,,,,0,,,,,L,landes,PACAG,Pacage,221,0.422216,43.179037
2021-1110698,2021-12-28,000001,Vente,130000,,,HORT ACHOUE,B044,65300,65150,Clarens,65,,,651500000B0006,,,,,,,,,,,,,0,,,,,L,landes,PACAG,Pacage,656,0.422869,43.179301
2021-1110698,2021-12-28,000001,Vente,130000,,,HORT ACHOUE,B044,65300,65150,Clarens,65,,,651500000B0007,,,,,,,,,,,,,0,,,,,J,jardins,,,1157,0.423039,43.179456
2021-1110698,2021-12-28,000001,Vente,130000,,,HORT ACHOUE,B044,65300,65150,Clarens,65,,,651500000B0018,,,,,,,,,,,,,0,,,,,E,eaux,CANAL,Canal,1340,0.423241,43.178195
2021-1110698,2021-12-28,000001,Vente,130000,,,HORT ACHOUE,B044,65300,65150,Clarens,65,,,651500000B0019,,,,,,,,,,,,,0,,,,,L,landes,PACAG,Pacage,74,0.422685,43.179092
2021-1110698,2021-12-28,000001,Vente,130000,,,HORT ACHOUE,B044,65300,65150,Clarens,65,,,651500000B0020,,,,,,,,,,,,,0,,,,,T,terres,,,2670,0.422798,43.178958
2021-1110698,2021-12-28,000001,Vente,130000,,,CAUBEYRES,B022,65300,65150,Clarens,65,,,651500000B0367,,,,,,,,,,,,,0,,,,,BT,taillis simples,,,473,0.422022,43.178622
2021-1110698,2021-12-28,000001,Vente,130000,,,CAUBEYRES,B022,65300,65150,Clarens,65,,,651500000B0570,,,,,,,,,,,,,0,,,,,L,landes,PACAG,Pacage,168,0.422152,43.178863
2021-1110698,2021-12-28,000001,Vente,130000,,,HORT ACHOUE,B044,65300,65150,Clarens,65,,,651500000B0707,,,,,,,,,,,,,0,,,,,P,prés,,,268,0.423128,43.180255
2021-1110698,2021-12-28,000001,Vente,130000,,,HORT ACHOUE,B044,65300,65150,Clarens,65,,,651500000B0823,,,,,,,,,,,,,0,,,,,T,terres,,,6565,0.42355,43.178717
2021-1110698,2021-12-28,000001,Vente,130000,,,HORT ACHOUE,B044,65300,65150,Clarens,65,,,651500000B0830,,,,,,,,,,,,,0,,,,,S,sols,,,102,0.423086,43.179691
2021-1110698,2021-12-28,000001,Vente,130000,,,HORT ACHOUE,B044,65300,65150,Clarens,65,,,651500000B0831,,,,,,,,,,,,,0,,,,,S,sols,,,66,0.422873,43.179655
2021-1110698,2021-12-28,000001,Vente,130000,60,,RTE DE GALAN,0030,65300,65150,Clarens,65,,,651500000B0832,,,,,,,,,,,,,0,3,Dépendance,,0,S,sols,,,630,0.423017,43.179893
2021-1110698,2021-12-28,000001,Vente,130000,60,,RTE DE GALAN,0030,65300,65150,Clarens,65,,,651500000B0832,,,,,,,,,,,,,0,1,Maison,119,3,S,sols,,,630,0.423017,43.179893
2021-1110698,2021-12-28,000001,Vente,130000,60,,RTE DE GALAN,0030,65300,65150,Clarens,65,,,651500000B0832,,,,,,,,,,,,,0,3,Dépendance,,0,S,sols,,,630,0.423017,43.179893
2021-1110698,2021-12-28,000001,Vente,130000,60,,RTE DE GALAN,0030,65300,65150,Clarens,65,,,651500000B0832,,,,,,,,,,,,,0,3,Dépendance,,0,S,sols,,,630,0.423017,43.179893
2021-1110698,2021-12-28,000001,Vente,130000,,,HORT ACHOUE,B044,65300,65150,Clarens,65,,,651500000B0833,,,,,,,,,,,,,0,,,,,S,sols,,,169,0.423122,43.179813
2021-1110698,2021-12-28,000001,Vente,130000,,,HORT ACHOUE,B044,65300,65150,Clarens,65,,,651500000B0835,,,,,,,,,,,,,0,,,,,S,sols,,,88,0.423242,43.179849
