id_mutation,date_mutation,numero_disposition,nature_mutation,valeur_fonciere,adresse_numero,adresse_suffixe,adresse_nom_voie,adresse_code_voie,code_postal,code_commune,nom_commune,code_departement,ancien_code_commune,ancien_nom_commune,id_parcelle,ancien_id_parcelle,numero_volume,lot1_numero,lot1_surface_carrez,lot2_numero,lot2_surface_carrez,lot3_numero,lot3_surface_carrez,lot4_numero,lot4_surface_carrez,lot5_numero,lot5_surface_carrez,nombre_lots,code_type_local,type_local,surface_reelle_bati,nombre_pieces_principales,code_nature_culture,nature_culture,code_nature_culture_speciale,nature_culture_speciale,surface_terrain,longitude,latitude
2021-1103613,2021-02-01,000001,Vente,1000,,,LA GOUTERE,B029,65330,65184,Galez,65,,,651840000A0493,,,,,,,,,,,,,0,,,,,BT,taillis simples,,,5130,0.394,43.184644
2021-1103614,2021-02-01,000001,Vente,4000,,,COULARADE,B021,65330,65184,Galez,65,,,651840000A0001,,,,,,,,,,,,,0,,,,,T,terres,,,9310,0.396764,43.193232
2021-1104038,2021-02-22,000001,Vente,,5084,,BRUCHOUS,B013,65330,65184,Galez,65,,,651840000A0615,,,,,,,,,,,,,0,1,Maison,110,4,S,sols,,,910,0.404057,43.193216
2021-1104038,2021-02-22,000001,Vente,,,,BRUCHOUS,B013,65330,65184,Galez,65,,,651840000A0617,,,,,,,,,,,,,0,,,,,J,jardins,,,1091,0.40406,43.192873
2021-1104040,2021-02-25,000001,Vente,107000,,,LACHARE,B035,65330,65184,Galez,65,,,651840000A0192,,,,,,,,,,,,,0,,,,,P,prés,,,5772,0.407854,43.19203
2021-1104040,2021-02-25,000001,Vente,107000,,,LACHARE,B035,65330,65184,Galez,65,,,651840000A0192,,,,,,,,,,,,,0,,,,,S,sols,,,78,0.407854,43.19203
2021-1104040,2021-02-25,000001,Vente,107000,5009,,LACHARE,B035,65330,65184,Galez,65,,,651840000A0193,,,,,,,,,,,,,0,1,Maison,87,2,S,sols,,,955,0.407978,43.191922
2021-1104040,2021-02-25,000001,Vente,107000,,,LACHARE,B035,65330,65184,Galez,65,,,651840000A0194,,,,,,,,,,,,,0,,,,,S,sols,,,345,0.408206,43.191987
2021-1104040,2021-02-25,000001,Vente,107000,,,LACHARE,B035,65330,65184,Galez,65,,,651840000A0195,,,,,,,,,,,,,0,,,,,J,jardins,,,875,0.408148,43.192185
2021-1104206,2021-03-13,000001,Vente,43000,,,BRUCHOUS,B013,65330,65184,Galez,65,,,651840000A0605,,,,,,,,,,,,,0,,,,,P,prés,,,629,0.403711,43.193243
2021-1104206,2021-03-13,000001,Vente,43000,,,BRUCHOUS,B013,65330,65184,Galez,65,,,651840000A0607,,,,,,,,,,,,,0,,,,,T,terres,,,698,0.403711,43.192991
2021-1104206,2021-03-13,000001,Vente,43000,,,BRUCHOUS,B013,65330,65184,Galez,65,,,651840000A0607,,,,,,,,,,,,,0,,,,,S,sols,,,500,0.403711,43.192991
2021-1106011,2021-06-14,000001,Vente,173000,,,LALOSSE,B038,65330,65184,Galez,65,,,651840000A0634,,,,,,,,,,,,,0,1,Maison,100,2,S,sols,,,1514,0.40261,43.19392
2021-1106273,2021-06-24,000001,Vente,18000,,,LALOSSE,B038,65330,65184,Galez,65,,,651840000A0633,,,,,,,,,,,,,0,,,,,AB,terrains a bâtir,,,1500,0.402986,43.193934
2021-1107255,2021-08-06,000001,Vente,1930.5,,,PALET,B053,65330,65184,Galez,65,,,651840000B0668,,,,,,,,,,,,,0,,,,,T,terres,,,2150,0.411436,43.182285
2021-1107255,2021-08-06,000001,Vente,1930.5,,,PALET,B053,65330,65184,Galez,65,,,651840000B0790,,,,,,,,,,,,,0,,,,,T,terres,,,2140,0.412248,43.181871
2021-1108005,2021-08-27,000001,Vente,11732,,,MOURASSAN,B050,65330,65184,Galez,65,,,65184000WA0026,,,,,,,,,,,,,0,,,,,T,terres,,,15172,0.408848,43.206426
2021-1109413,2021-11-12,000001,Vente,2500,,,LA LANDE,B040,65330,65184,Galez,65,,,651840000C0109,,,,,,,,,,,,,0,,,,,L,landes,,,2750,0.394199,43.173573
2021-1109413,2021-11-12,000001,Vente,2500,,,BARRAN,B003,65330,65184,Galez,65,,,651840000C0223,,,,,,,,,,,,,0,,,,,BT,taillis simples,,,4370,0.396174,43.174281
2021-1109554,2021-11-03,000001,Vente,5000,,,GOUTE AVARE,B027,65330,65184,Galez,65,,,651840000B0345,,,,,,,,,,,,,0,,,,,T,terres,,,2380,0.416589,43.193134
2021-1109554,2021-11-03,000001,Vente,5000,,,PLAGNE DE DEBAT,B056,65330,65184,Galez,65,,,651840000B0520,,,,,,,,,,,,,0,,,,,T,terres,,,2960,0.416998,43.191742
2021-1109554,2021-11-03,000001,Vente,5000,,,PLAGNE DE DEBAT,B056,65330,65184,Galez,65,,,651840000B0526,,,,,,,,,,,,,0,,,,,T,terres,,,2320,0.41646,43.19105
2021-1110175,2021-12-20,000001,Vente,3100,,,PLAGNE DE DEBAT,B056,65330,65184,Galez,65,,,651840000B0545,,,,,,,,,,,,,0,,,,,BT,taillis simples,,,1190,0.415063,43.186445
2021-1110175,2021-12-20,000001,Vente,3100,,,PLAGNE DE DEBAT,B056,65330,65184,Galez,65,,,651840000B0546,,,,,,,,,,,,,0,,,,,T,terres,,,5400,0.414542,43.186601
2021-1110178,2021-12-14,000001,Vente,2000,,,BARRAN,B003,65330,65184,Galez,65,,,651840000C0196,,,,,,,,,,,,,0,,,,,BT,taillis simples,,,6260,0.396202,43.178088
2021-1110178,2021-12-14,000001,Vente,2000,,,BARRAN,B003,65330,65184,Galez,65,,,651840000C0198,,,,,,,,,,,,,0,,,,,BF,futaies feuillues,,,3630,0.395975,43.177002
