id_mutation,date_mutation,numero_disposition,nature_mutation,valeur_fonciere,adresse_numero,adresse_suffixe,adresse_nom_voie,adresse_code_voie,code_postal,code_commune,nom_commune,code_departement,ancien_code_commune,ancien_nom_commune,id_parcelle,ancien_id_parcelle,numero_volume,lot1_numero,lot1_surface_carrez,lot2_numero,lot2_surface_carrez,lot3_numero,lot3_surface_carrez,lot4_numero,lot4_surface_carrez,lot5_numero,lot5_surface_carrez,nombre_lots,code_type_local,type_local,surface_reelle_bati,nombre_pieces_principales,code_nature_culture,nature_culture,code_nature_culture_speciale,nature_culture_speciale,surface_terrain,longitude,latitude
2021-1104874,2021-04-09,000001,Vente,500,,,CONCAZAUX,B004,65320,65189,Gayan,65,,,651890000B0405,,,,,,,,,,,,,0,,,,,T,terres,,,567,0.044552,43.308407
2021-1105382,2021-05-11,000001,Vente,135000,,,ARTIGOLES,B001,65320,65189,Gayan,65,,,651890000A0366,,,,,,,,,,,,,0,,,,,T,terres,,,45473,0.044917,43.298449
2021-1105382,2021-05-11,000001,Vente,135000,,,LA POUTGETTE,B014,65320,65189,Gayan,65,,,651890000A0503,,,,,,,,,,,,,0,,,,,T,terres,,,51798,0.044853,43.300457
2021-1105382,2021-05-11,000001,Vente,135000,,,ARTIGOLES,B001,65320,65189,Gayan,65,,,651890000A0505,,,,,,,,,,,,,0,,,,,T,terres,,,5844,0.042356,43.300431
2021-1105382,2021-05-11,000001,Vente,135000,,,ARTIGOLES,B001,65320,65189,Gayan,65,,,651890000A0507,,,,,,,,,,,,,0,,,,,T,terres,,,1389,0.041383,43.300501
2021-1105382,2021-05-11,000001,Vente,135000,,,ARTIGOLES,B001,65320,65189,Gayan,65,,,651890000A0526,,,,,,,,,,,,,0,,,,,T,terres,,,142,0.04351,43.301019
2021-1106651,2021-07-09,000001,Vente,7350,,,LE CABIRO,B002,65320,65189,Gayan,65,,,651890000B0196,,,,,,,,,,,,,0,,,,,P,prés,,,8164,0.057912,43.303271
2021-1107665,2021-08-09,000001,Vente,237000,6,,RUE DU LEVANT,0055,65320,65189,Gayan,65,,,651890000A0497,,,,,,,,,,,,,0,1,Maison,167,5,S,sols,,,1500,0.043421,43.305662
2021-1108162,2021-09-14,000001,Vente,264400,3,,RUE DU CANAL,0026,65320,65189,Gayan,65,,,651890000A0383,,,,,,,,,,,,,0,3,Dépendance,,0,S,sols,,,2300,0.040112,43.306806
2021-1108162,2021-09-14,000001,Vente,264400,3,,RUE DU CANAL,0026,65320,65189,Gayan,65,,,651890000A0383,,,,,,,,,,,,,0,1,Maison,110,5,S,sols,,,2300,0.040112,43.306806
2021-1108545,2021-09-22,000001,Vente,125000,,,L ECHEZ,B005,65320,65189,Gayan,65,,,651890000A0230,,,,,,,,,,,,,0,,,,,T,terres,,,2258,0.038663,43.306554
2021-1108545,2021-09-22,000001,Vente,125000,,,L ECHEZ,B005,65320,65189,Gayan,65,,,651890000A0231,,,,,,,,,,,,,0,,,,,S,sols,,,48,0.038455,43.307003
2021-1108545,2021-09-22,000001,Vente,125000,,,L ECHEZ,B005,65320,65189,Gayan,65,,,651890000A0231,,,,,,,,,,,,,0,,,,,J,jardins,,,532,0.038455,43.307003
2021-1108545,2021-09-22,000001,Vente,125000,7,,RUE DU COUCHANT,0030,65320,65189,Gayan,65,,,651890000A0232,,,,,,,,,,,,,0,1,Maison,77,4,S,sols,,,390,0.038455,43.307173
2021-1110171,2021-12-07,000001,Vente,240000,,,CONCAZAUX,B004,65320,65189,Gayan,65,,,651890000B0399,,,,,,,,,,,,,0,,,,,T,terres,,,28,0.047318,43.310653
2021-1110171,2021-12-07,000001,Vente,240000,14,,QUA DES SOURCES,A060,65320,65189,Gayan,65,,,651890000B0403,,,,,,,,,,,,,0,1,Maison,134,5,S,sols,,,1000,0.047395,43.310298
2021-1110171,2021-12-07,000001,Vente,240000,14,,QUA DES SOURCES,A060,65320,65189,Gayan,65,,,651890000B0403,,,,,,,,,,,,,0,3,Dépendance,,0,S,sols,,,1000,0.047395,43.310298
2021-1110171,2021-12-07,000001,Vente,240000,14,,QUA DES SOURCES,A060,65320,65189,Gayan,65,,,651890000B0403,,,,,,,,,,,,,0,1,Maison,134,5,P,prés,,,1317,0.047395,43.310298
2021-1110171,2021-12-07,000001,Vente,240000,14,,QUA DES SOURCES,A060,65320,65189,Gayan,65,,,651890000B0403,,,,,,,,,,,,,0,3,Dépendance,,0,P,prés,,,1317,0.047395,43.310298
2021-1110506,2021-12-23,000001,Vente,7000,,,PLECH,B013,65320,65189,Gayan,65,,,651890000A0189,,,,,,,,,,,,,0,,,,,P,prés,,,12390,0.039441,43.298243
2021-1110712,2021-12-23,000001,Vente,6000,,,LAPEYRADE,B008,65320,65189,Gayan,65,,,651890000B0113,,,,,,,,,,,,,0,,,,,P,prés,,,3550,0.05328,43.309805
2021-1110712,2021-12-23,000001,Vente,6000,,,LAPEYRADE,B008,65320,65189,Gayan,65,,,651890000B0114,,,,,,,,,,,,,0,,,,,P,prés,,,3881,0.053186,43.309375
