id_mutation,date_mutation,numero_disposition,nature_mutation,valeur_fonciere,adresse_numero,adresse_suffixe,adresse_nom_voie,adresse_code_voie,code_postal,code_commune,nom_commune,code_departement,ancien_code_commune,ancien_nom_commune,id_parcelle,ancien_id_parcelle,numero_volume,lot1_numero,lot1_surface_carrez,lot2_numero,lot2_surface_carrez,lot3_numero,lot3_surface_carrez,lot4_numero,lot4_surface_carrez,lot5_numero,lot5_surface_carrez,nombre_lots,code_type_local,type_local,surface_reelle_bati,nombre_pieces_principales,code_nature_culture,nature_culture,code_nature_culture_speciale,nature_culture_speciale,surface_terrain,longitude,latitude
2021-1537324,2021-10-07,000001,Vente,365000,2,,RUE DES LOUVERIES,0270,91690,91533,Saclas,91,,,91533000AE0232,,,,,,,,,,,,,0,3,Dépendance,,0,S,sols,,,1425,,
2021-1537324,2021-10-07,000001,Vente,365000,2,,RUE DES LOUVERIES,0270,91690,91533,Saclas,91,,,91533000AE0232,,,,,,,,,,,,,0,1,Maison,137,4,S,sols,,,1425,,
2021-1537324,2021-10-07,000001,Vente,365000,2,,RUE DES LOUVERIES,0270,91690,91533,Saclas,91,,,91533000AE0232,,,,,,,,,,,,,0,1,Maison,129,5,S,sols,,,1425,,
2021-1537324,2021-10-07,000001,Vente,365000,2,,RUE DES LOUVERIES,0270,91690,91533,Saclas,91,,,91533000AE0232,,,,,,,,,,,,,0,3,Dépendance,,0,S,sols,,,1425,,
2021-1538320,2021-10-21,000001,Vente,245000,,,LE MOULIN BOUDARD,B063,91690,91533,Saclas,91,,,91533000AE0692,,,1,,,,,,,,,,1,1,Maison,129,5,,,,,,2.121928,48.359068
2021-1538320,2021-10-21,000001,Vente,245000,,,LE MOULIN BOUDARD,B063,91690,91533,Saclas,91,,,91533000AE0692,,,1,,,,,,,,,,1,3,Dépendance,,0,,,,,,2.121928,48.359068
2021-1538320,2021-10-21,000001,Vente,245000,,,LE MOULIN BOUDARD,B063,91690,91533,Saclas,91,,,91533000AE0693,,,,,,,,,,,,,0,,,,,S,sols,,,656,2.121906,48.359125
2021-1538480,2021-11-09,000001,Vente,257000,,,LE MOULIN BOUDARD,B063,91690,91533,Saclas,91,,,91533000AE0692,,,2,,,,,,,,,,1,1,Maison,140,4,,,,,,2.121928,48.359068
2021-1538480,2021-11-09,000001,Vente,257000,,,LE MOULIN BOUDARD,B063,91690,91533,Saclas,91,,,91533000AE0694,,,,,,,,,,,,,0,,,,,S,sols,,,514,2.121994,48.358946
2021-1538647,2021-11-17,000001,Vente,300000,11,,RUE DE PONT A CHAT,0315,91690,91533,Saclas,91,,,91533000AH0218,,,,,,,,,,,,,0,1,Maison,106,5,S,sols,,,400,2.111749,48.361484
2021-1538647,2021-11-17,000001,Vente,300000,11,,RUE DE PONT A CHAT,0315,91690,91533,Saclas,91,,,91533000AH0218,,,,,,,,,,,,,0,1,Maison,106,5,J,jardins,POTAG,Jardin potager,1352,2.111749,48.361484
2021-1539115,2021-11-03,000001,Vente,501,,,LES PRES DE LA PATROUILLE,B088,91690,91533,Saclas,91,,,91533000AL0064,,,,,,,,,,,,,0,,,,,BT,taillis simples,,,718,2.109136,48.344567
2021-1539115,2021-11-03,000001,Vente,501,,,LES PRES DE LA PATROUILLE,B088,91690,91533,Saclas,91,,,91533000AL0065,,,,,,,,,,,,,0,,,,,BT,taillis simples,,,636,2.109056,48.344526
2021-1539390,2021-10-22,000001,Vente,375797,,,LES LOUVERIES,B059,91690,91533,Saclas,91,,,91533000AK0094,,,,,,,,,,,,,0,,,,,BT,taillis simples,,,882,2.115449,48.360393
2021-1539390,2021-10-22,000001,Vente,375797,,,LES LOUVERIES,B059,91690,91533,Saclas,91,,,91533000AK0095,,,,,,,,,,,,,0,,,,,BT,taillis simples,,,535,2.115589,48.360239
2021-1539390,2021-10-22,000001,Vente,375797,53,,RUE DES LOUVERIES,0270,91690,91533,Saclas,91,,,91533000AK0840,,,,,,,,,,,,,0,1,Maison,130,5,S,sols,,,500,2.115368,48.360113
2021-1539390,2021-10-22,000001,Vente,375797,53,,RUE DES LOUVERIES,0270,91690,91533,Saclas,91,,,91533000AK0840,,,,,,,,,,,,,0,3,Dépendance,,0,BT,taillis simples,,,1745,2.115368,48.360113
2021-1539390,2021-10-22,000001,Vente,375797,53,,RUE DES LOUVERIES,0270,91690,91533,Saclas,91,,,91533000AK0840,,,,,,,,,,,,,0,1,Maison,130,5,BT,taillis simples,,,1745,2.115368,48.360113
2021-1539390,2021-10-22,000001,Vente,375797,53,,RUE DES LOUVERIES,0270,91690,91533,Saclas,91,,,91533000AK0840,,,,,,,,,,,,,0,3,Dépendance,,0,AG,terrains d'agrément,PARC,Parc,1000,2.115368,48.360113
2021-1539390,2021-10-22,000001,Vente,375797,53,,RUE DES LOUVERIES,0270,91690,91533,Saclas,91,,,91533000AK0840,,,,,,,,,,,,,0,1,Maison,130,5,AG,terrains d'agrément,PARC,Parc,1000,2.115368,48.360113
2021-1539390,2021-10-22,000001,Vente,375797,53,,RUE DES LOUVERIES,0270,91690,91533,Saclas,91,,,91533000AK0840,,,,,,,,,,,,,0,3,Dépendance,,0,S,sols,,,500,2.115368,48.360113
2021-1541227,2021-12-27,000001,Vente,12000,,,MONTOIR DE PONT DE LUCON,B062,91690,91533,Saclas,91,,,91533000AK0233,,,,,,,,,,,,,0,,,,,BT,taillis simples,,,2180,2.111404,48.349478
2021-1541227,2021-12-27,000001,Vente,12000,,,HAM DE PONT DE LUCON,B049,91690,91533,Saclas,91,,,91533000AK0961,,,,,,,,,,,,,0,,,,,S,sols,,,84,2.111261,48.349081
2021-1541471,2021-12-17,000001,Vente,160000,,,ST DENIS,B107,91690,91533,Saclas,91,,,91533000AL0364,,2,,,,,,,,,,,0,,,,,,,,,,2.113434,48.348435
2021-1541471,2021-12-17,000001,Vente,160000,2,A,RUE DE MEREVILLE,0280,91690,91533,Saclas,91,,,91533000AL0383,,,12,100.38,,,,,,,,,1,3,Dépendance,,0,,,,,,2.113475,48.348416
2021-1541471,2021-12-17,000001,Vente,160000,2,A,RUE DE MEREVILLE,0280,91690,91533,Saclas,91,,,91533000AL0383,,,12,100.38,,,,,,,,,1,2,Appartement,95,4,,,,,,2.113475,48.348416
2021-1541491,2021-12-22,000001,Vente,50000,,,JUBERT,B055,91690,91533,Saclas,91,,,91533000AD0013,,,,,,,,,,,,,0,,,,,J,jardins,POTAG,Jardin potager,370,2.125928,48.362066
2021-1542075,2021-12-21,000001,Vente,313900,,,CHATILLON,B014,91690,91533,Saclas,91,,,91533000AE0338,,,,,,,,,,,,,0,,,,,S,sols,,,42,2.123281,48.358702
2021-1542075,2021-12-21,000001,Vente,313900,,,CHATILLON,B014,91690,91533,Saclas,91,,,91533000AE0399,,,,,,,,,,,,,0,,,,,S,sols,,,87,2.122926,48.358641
2021-1542075,2021-12-21,000001,Vente,313900,1,,PL DE GRENET,0120,91690,91533,Saclas,91,,,91533000AE0417,,,,,,,,,,,,,0,4,Local industriel. commercial ou assimilé,698,0,S,sols,,,1481,2.123128,48.358501
2021-1542075,2021-12-21,000001,Vente,313900,1,,PL DE GRENET,0120,91690,91533,Saclas,91,,,91533000AE0417,,,,,,,,,,,,,0,1,Maison,173,6,S,sols,,,1481,2.123128,48.358501
2021-1542075,2021-12-21,000001,Vente,313900,1,,PL DE GRENET,0120,91690,91533,Saclas,91,,,91533000AE0417,,,,,,,,,,,,,0,4,Local industriel. commercial ou assimilé,264,0,S,sols,,,1481,2.123128,48.358501
2021-1542696,2021-11-26,000002,Vente,435000,5195,A,LA PATROUILLE,B070,91690,91533,Saclas,91,,,91533000AL0171,,,,,,,,,,,,,0,4,Local industriel. commercial ou assimilé,,0,BT,taillis simples,,,1517,2.110971,48.344701
2021-1542696,2021-11-26,000002,Vente,435000,5195,A,LA PATROUILLE,B070,91690,91533,Saclas,91,,,91533000AL0171,,,,,,,,,,,,,0,4,Local industriel. commercial ou assimilé,,0,S,sols,,,45,2.110971,48.344701
2021-1542696,2021-11-26,000002,Vente,435000,,,LES FRICHES DE LA PATROUIL,B029,91690,91533,Saclas,91,,,91533000AL0192,,,,,,,,,,,,,0,,,,,BT,taillis simples,,,142,2.113483,48.345409
2021-1542696,2021-11-26,000002,Vente,435000,,,LES FRICHES DE LA PATROUIL,B029,91690,91533,Saclas,91,,,91533000AL0193,,,,,,,,,,,,,0,,,,,BR,futaies résineuses,,,6740,2.112338,48.345071
2021-1542696,2021-11-26,000002,Vente,435000,,,LES GDES GROUETTES,B035,91690,91533,Saclas,91,,,91533000AL0216,,,,,,,,,,,,,0,,,,,BT,taillis simples,,,408,2.115406,48.346683
2021-1542696,2021-11-26,000002,Vente,435000,,,LA VAL PARRAIN,B112,91690,91533,Saclas,91,,,91533000AL0267,,,,,,,,,,,,,0,,,,,BT,taillis simples,,,7460,2.111589,48.34061
2021-1542696,2021-11-26,000002,Vente,435000,,,LA VAL PARRAIN,B112,91690,91533,Saclas,91,,,91533000AL0268,,,,,,,,,,,,,0,,,,,BT,taillis simples,,,6660,2.110792,48.340597
2021-1542696,2021-11-26,000002,Vente,435000,,,LA VAL PARRAIN,B112,91690,91533,Saclas,91,,,91533000AL0269,,,,,,,,,,,,,0,,,,,BT,taillis simples,,,3660,2.110409,48.341208
2021-1542696,2021-11-26,000002,Vente,435000,4,,RTE D AUTRUY,0004,91690,91533,Saclas,91,,,91533000AL0404,,,,,,,,,,,,,0,1,Maison,80,3,,,,,,2.112083,48.343977
2021-1542696,2021-11-26,000002,Vente,435000,4,,RTE D AUTRUY,0004,91690,91533,Saclas,91,,,91533000AL0404,,,,,,,,,,,,,0,1,Maison,451,10,,,,,,2.112083,48.343977
2021-1542696,2021-11-26,000002,Vente,435000,4,,RTE D AUTRUY,0004,91690,91533,Saclas,91,,,91533000AL0404,,,,,,,,,,,,,0,3,Dépendance,,0,,,,,,2.112083,48.343977
2021-1542696,2021-11-26,000002,Vente,435000,4,,RTE D AUTRUY,0004,91690,91533,Saclas,91,,,91533000AL0404,,,,,,,,,,,,,0,3,Dépendance,,0,,,,,,2.112083,48.343977
2021-1542696,2021-11-26,000002,Vente,435000,4,,RTE D AUTRUY,0004,91690,91533,Saclas,91,,,91533000AL0404,,,,,,,,,,,,,0,3,Dépendance,,0,,,,,,2.112083,48.343977
2021-1542696,2021-11-26,000002,Vente,435000,4,,RTE D AUTRUY,0004,91690,91533,Saclas,91,,,91533000AL0404,,,,,,,,,,,,,0,3,Dépendance,,0,,,,,,2.112083,48.343977
2021-1550072,2021-01-08,000001,Vente,262000,26,,RUE JULIEN BIDOCHON,0255,91690,91533,Saclas,91,,,91533000AK0745,,,,,,,,,,,,,0,1,Maison,106,4,S,sols,,,1000,2.118389,48.356013
2021-1550097,2021-01-19,000001,Vente,210000,15,A,RUE JOLIOT-CURIE,0240,91690,91533,Saclas,91,,,91533000AE0574,,,1,88.1,,,,,,,,,1,1,Maison,95,5,,,,,,2.124994,48.359088
2021-1550133,2021-01-20,000001,Vente,334000,12,,RUE DE L ORME,0300,91690,91533,Saclas,91,,,91533000AK0793,,,,,,,,,,,,,0,1,Maison,214,7,AG,terrains d'agrément,PARC,Parc,933,2.109833,48.352643
2021-1550133,2021-01-20,000001,Vente,334000,12,,RUE DE L ORME,0300,91690,91533,Saclas,91,,,91533000AK0793,,,,,,,,,,,,,0,1,Maison,214,7,BT,taillis simples,,,900,2.109833,48.352643
2021-1550133,2021-01-20,000001,Vente,334000,12,,RUE DE L ORME,0300,91690,91533,Saclas,91,,,91533000AK0793,,,,,,,,,,,,,0,1,Maison,214,7,S,sols,,,500,2.109833,48.352643
2021-1550221,2021-01-29,000001,Vente,246000,1,,RUE DES LOUVERIES,0270,91690,91533,Saclas,91,,,91533000AE0295,,,,,,,,,,,,,0,1,Maison,69,4,J,jardins,POTAG,Jardin potager,804,2.12131,48.358923
2021-1550221,2021-01-29,000001,Vente,246000,1,,RUE DES LOUVERIES,0270,91690,91533,Saclas,91,,,91533000AE0295,,,,,,,,,,,,,0,1,Maison,69,4,S,sols,,,76,2.12131,48.358923
2021-1550331,2021-01-26,000001,Vente,,,,LES PENTES DE JUBERT,B072,91690,91533,Saclas,91,,,91533000AC0043,,,,,,,,,,,,,0,,,,,BT,taillis simples,,,1645,2.130029,48.364175
2021-1550331,2021-01-26,000001,Vente,,,,JUBERT,B055,91690,91533,Saclas,91,,,91533000AD0136,,,,,,,,,,,,,0,,,,,P,prés,,,1862,2.131436,48.363094
2021-1550331,2021-01-26,000001,Vente,,32,,RUE DE JUBERT,0250,91690,91533,Saclas,91,,,91533000AD0381,,,,,,,,,,,,,0,1,Maison,141,6,S,sols,,,1000,2.130714,48.363294
2021-1550331,2021-01-26,000001,Vente,,32,,RUE DE JUBERT,0250,91690,91533,Saclas,91,,,91533000AD0381,,,,,,,,,,,,,0,1,Maison,141,6,AG,terrains d'agrément,PARC,Parc,2800,2.130714,48.363294
2021-1550331,2021-01-26,000001,Vente,,32,,RUE DE JUBERT,0250,91690,91533,Saclas,91,,,91533000AD0381,,,,,,,,,,,,,0,1,Maison,141,6,BT,taillis simples,,,981,2.130714,48.363294
2021-1550419,2021-02-25,000001,Vente,553200,18,,RUE DES NATIONS,0290,91690,91533,Saclas,91,,,91533000AB0098,,,,,,,,,,,,,0,1,Maison,111,5,S,sols,,,800,2.146975,48.380538
2021-1550419,2021-02-25,000001,Vente,553200,18,,RUE DES NATIONS,0290,91690,91533,Saclas,91,,,91533000AB0098,,,,,,,,,,,,,0,1,Maison,111,5,AG,terrains d'agrément,PARC,Parc,6337,2.146975,48.380538
2021-1550703,2021-03-05,000001,Vente,315000,,,LE PRE FAVIER,B083,91690,91533,Saclas,91,,,91533000AK0337,,,,,,,,,,,,,0,,,,,S,sols,,,175,2.116625,48.355118
2021-1550703,2021-03-05,000001,Vente,315000,9,,RUE DE GITTONVILLE,0095,91690,91533,Saclas,91,,,91533000AK0338,,,,,,,,,,,,,0,1,Maison,150,6,J,jardins,POTAG,Jardin potager,800,2.116888,48.354878
2021-1550703,2021-03-05,000001,Vente,315000,9,,RUE DE GITTONVILLE,0095,91690,91533,Saclas,91,,,91533000AK0338,,,,,,,,,,,,,0,1,Maison,150,6,S,sols,,,300,2.116888,48.354878
2021-1550839,2021-04-13,000001,Vente,220000,15,A,RUE JOLIOT-CURIE,0240,91690,91533,Saclas,91,,,91533000AE0574,,,3,110.73,,,,,,,,,1,1,Maison,83,5,,,,,,2.124994,48.359088
2021-1550911,2021-04-20,000001,Vente,315000,34,,RUE DE GITTONVILLE,0095,91690,91533,Saclas,91,,,91533000AK0165,,,,,,,,,,,,,0,1,Maison,130,4,S,sols,,,240,2.112113,48.353446
2021-1550911,2021-04-20,000001,Vente,315000,,,LA COTE DE GITTONVILLE,B019,91690,91533,Saclas,91,,,91533000AK0743,,,,,,,,,,,,,0,,,,,BT,taillis simples,,,4956,2.11191,48.353504
2021-1550911,2021-04-20,000001,Vente,315000,5239,A,HAM DE GITTONVILLE,B045,91690,91533,Saclas,91,,,91533000AK0744,,,,,,,,,,,,,0,4,Local industriel. commercial ou assimilé,,0,S,sols,,,44,2.112036,48.353294
2021-1551213,2021-04-28,000001,Vente,167000,2,B,RUE DE MEREVILLE,0280,91690,91533,Saclas,91,,,91533000AL0383,,,13,96.39,,,,,,,,,1,2,Appartement,98,3,,,,,,2.113475,48.348416
2021-1551257,2021-05-17,000001,Vente,154150,1,,RUE DE GRENET,0125,91690,91533,Saclas,91,,,91533000AE0568,,,7,,,,,,,,,,1,3,Dépendance,,0,,,,,,2.123525,48.357438
2021-1551257,2021-05-17,000001,Vente,154150,1,,RUE DE GRENET,0125,91690,91533,Saclas,91,,,91533000AE0568,,,2,53.69,,,,,,,,,1,2,Appartement,54,3,,,,,,2.123525,48.357438
2021-1551257,2021-05-17,000001,Vente,154150,1,,RUE DE GRENET,0125,91690,91533,Saclas,91,,,91533000AE0568,,,11,,,,,,,,,,1,3,Dépendance,,0,,,,,,2.123525,48.357438
2021-1551269,2021-05-21,000001,Vente,45000,5308,D,RUE DES LOUVERIES,0270,91690,91533,Saclas,91,,,91533000AK0919,,,,,,,,,,,,,0,1,Maison,32,2,AG,terrains d'agrément,PARC,Parc,1072,2.115788,48.360091
2021-1551269,2021-05-21,000001,Vente,45000,5308,D,RUE DES LOUVERIES,0270,91690,91533,Saclas,91,,,91533000AK0919,,,,,,,,,,,,,0,1,Maison,32,2,S,sols,,,500,2.115788,48.360091
2021-1551280,2021-05-05,000001,Vente,234000,,,LES PENTES DE JUBERT,B072,91690,91533,Saclas,91,,,91533000AC0010,,,,,,,,,,,,,0,,,,,BT,taillis simples,,,1460,2.125377,48.362744
2021-1551280,2021-05-05,000001,Vente,234000,,,LES PENTES DE JUBERT,B072,91690,91533,Saclas,91,,,91533000AC0011,,,,,,,,,,,,,0,,,,,J,jardins,POTAG,Jardin potager,600,2.12521,48.362396
2021-1551280,2021-05-05,000001,Vente,234000,12,,RUE JEAN MOULIN,0230,91690,91533,Saclas,91,,,91533000AC0012,,,,,,,,,,,,,0,1,Maison,74,3,S,sols,,,335,2.12535,48.362307
2021-1551281,2021-05-20,000001,Vente,234000,14,,RUE VICTOR GRIFFUELHES,0495,91690,91533,Saclas,91,,,91533000AK0525,,,,,,,,,,,,,0,1,Maison,74,4,S,sols,,,147,2.115902,48.350931
2021-1551281,2021-05-20,000001,Vente,234000,,,HAM DE GRAVIER,B046,91690,91533,Saclas,91,,,91533000AK0648,,,,,,,,,,,,,0,,,,,S,sols,,,400,2.11569,48.351042
2021-1551281,2021-05-20,000001,Vente,234000,,,HAM DE GRAVIER,B046,91690,91533,Saclas,91,,,91533000AK0648,,,,,,,,,,,,,0,,,,,AG,terrains d'agrément,PARC,Parc,760,2.11569,48.351042
2021-1551487,2021-06-04,000001,Vente,214260,14,,RUE DES GRAVIERS,0100,91690,91533,Saclas,91,,,91533000AK0821,,,1,123.81,2,,3,,,,,,3,1,Maison,100,3,,,,,,2.121543,48.35357
2021-1551487,2021-06-04,000001,Vente,214260,14,,RUE DES GRAVIERS,0100,91690,91533,Saclas,91,,,91533000AK0821,,,25,,,,,,,,,,1,,,,,S,sols,,,61,2.121543,48.35357
2021-1551574,2021-06-15,000001,Vente,210000,10,,LE CREUX DE LA BORNE,B021,91690,91533,Saclas,91,,,91533000AE0123,,,,,,,,,,,,,0,1,Maison,64,4,J,jardins,POTAG,Jardin potager,813,2.126109,48.356433
2021-1551574,2021-06-15,000001,Vente,210000,10,,LE CREUX DE LA BORNE,B021,91690,91533,Saclas,91,,,91533000AE0123,,,,,,,,,,,,,0,1,Maison,64,4,S,sols,,,76,2.126109,48.356433
2021-1551669,2021-06-22,000001,Vente,94000,6,,RUE DES GRAVIERS,0100,91690,91533,Saclas,91,,,91533000AK0707,,,,,,,,,,,,,0,1,Maison,25,1,S,sols,,,106,2.122161,48.353904
2021-1551672,2021-06-25,000001,Vente,195000,1,,RUE DE PONT A CHAT,0315,91690,91533,Saclas,91,,,91533000AI0033,,,,,,,,,,,,,0,1,Maison,97,5,S,sols,,,720,2.111132,48.361369
2021-1551753,2021-06-29,000001,Vente,510000,,,HAM DE BIERVILLE,B044,91690,91533,Saclas,91,,,91533000AB0045,,,,,,,,,,,,,0,,,,,BP,peupleraies,,,3542,2.147445,48.381356
2021-1551753,2021-06-29,000001,Vente,510000,,,HAM DE BIERVILLE,B044,91690,91533,Saclas,91,,,91533000AB0046,,,,,,,,,,,,,0,,,,,AG,terrains d'agrément,PARC,Parc,255,2.14714,48.380916
2021-1551753,2021-06-29,000001,Vente,510000,,,HAM DE BIERVILLE,B044,91690,91533,Saclas,91,,,91533000AB0049,,,,,,,,,,,,,0,,,,,J,jardins,POTAG,Jardin potager,2010,2.146354,48.380736
2021-1551753,2021-06-29,000001,Vente,510000,5065,,HAM DE BIERVILLE,B044,91690,91533,Saclas,91,,,91533000AB0051,,,,,,,,,,,,,0,1,Maison,184,7,S,sols,,,1620,2.145982,48.380508
2021-1551753,2021-06-29,000001,Vente,510000,5065,,HAM DE BIERVILLE,B044,91690,91533,Saclas,91,,,91533000AB0051,,,,,,,,,,,,,0,3,Dépendance,,0,S,sols,,,1620,2.145982,48.380508
2021-1551753,2021-06-29,000001,Vente,510000,5065,,HAM DE BIERVILLE,B044,91690,91533,Saclas,91,,,91533000AB0051,,,,,,,,,,,,,0,3,Dépendance,,0,S,sols,,,1620,2.145982,48.380508
2021-1551753,2021-06-29,000001,Vente,510000,5065,,HAM DE BIERVILLE,B044,91690,91533,Saclas,91,,,91533000AB0051,,,,,,,,,,,,,0,3,Dépendance,,0,S,sols,,,1620,2.145982,48.380508
2021-1551753,2021-06-29,000001,Vente,510000,,,HAM DE BIERVILLE,B044,91690,91533,Saclas,91,,,91533000AB0052,,,,,,,,,,,,,0,,,,,J,jardins,POTAG,Jardin potager,14,2.145703,48.380704
2021-1551951,2021-07-17,000001,Vente,415000,17,T,RUE PASTEUR,0310,91690,91533,Saclas,91,,,91533000AK0880,,,,,,,,,,,,,0,1,Maison,153,6,AG,terrains d'agrément,PARC,Parc,1127,2.111247,48.350029
2021-1551951,2021-07-17,000001,Vente,415000,17,T,RUE PASTEUR,0310,91690,91533,Saclas,91,,,91533000AK0880,,,,,,,,,,,,,0,1,Maison,153,6,S,sols,,,500,2.111247,48.350029
2021-1552110,2021-07-28,000001,Vente,138355,8,,RUE DE LA MAIRIE,0275,91690,91533,Saclas,91,,,91533000AE0016,,,2,75.85,3,,,,,,,,2,2,Appartement,65,3,,,,,,2.126099,48.361077
2021-1552110,2021-07-28,000001,Vente,138355,8,,RUE DE LA MAIRIE,0275,91690,91533,Saclas,91,,,91533000AE0016,,,2,75.85,3,,,,,,,,2,3,Dépendance,,0,,,,,,2.126099,48.361077
2021-1552110,2021-07-28,000001,Vente,138355,4,,RUE DE LA MAIRIE,0275,91690,91533,Saclas,91,,,91533000AE0562,,,,,,,,,,,,,0,3,Dépendance,,0,S,sols,,,18,2.126027,48.360978
2021-1552110,2021-07-28,000001,Vente,138355,,,SACLAS,B104,91690,91533,Saclas,91,,,91533000AE0563,,,,,,,,,,,,,0,,,,,S,sols,,,5,2.126048,48.360954
2021-1552116,2021-07-23,000001,Vente,145000,,,LES PRES DES CROSNES,B092,91690,91533,Saclas,91,,,91533000AD0390,,,,,,,,,,,,,0,,,,,S,sols,,,375,2.127941,48.361157
2021-1552116,2021-07-23,000001,Vente,145000,3,,BD LEGRAND,0113,91690,91533,Saclas,91,,,91533000AD0391,,,,,,,,,,,,,0,3,Dépendance,,0,S,sols,,,294,2.12787,48.361089
2021-1552116,2021-07-23,000001,Vente,145000,3,,BD LEGRAND,0113,91690,91533,Saclas,91,,,91533000AD0391,,,,,,,,,,,,,0,1,Maison,82,5,S,sols,,,294,2.12787,48.361089
2021-1552149,2021-08-02,000001,Vente,370000,6,B,RUE DE MEREVILLE,0280,91690,91533,Saclas,91,,,91533000AL0387,,,,,,,,,,,,,0,1,Maison,136,6,S,sols,,,500,2.111951,48.346974
2021-1552149,2021-08-02,000001,Vente,370000,6,B,RUE DE MEREVILLE,0280,91690,91533,Saclas,91,,,91533000AL0387,,,,,,,,,,,,,0,1,Maison,136,6,AG,terrains d'agrément,PARC,Parc,1519,2.111951,48.346974
2021-1552203,2021-07-21,000001,Vente,128000,15,,RUE JOLIOT-CURIE,0240,91690,91533,Saclas,91,,,91533000AE0187,,,14,49.38,,,,,,,,,1,2,Appartement,52,2,,,,,,2.124662,48.359052
2021-1552269,2021-07-23,000001,Vente,238000,15,A,RUE JOLIOT-CURIE,0240,91690,91533,Saclas,91,,,91533000AE0574,,,7,72.13,,,,,,,,,1,1,Maison,80,5,,,,,,2.124994,48.359088
2021-1552334,2021-08-17,000001,Vente,250000,,,LA BRETONNIERE,B010,91690,91533,Saclas,91,,,91533000AM0121,,,,,,,,,,,,,0,,,,,BT,taillis simples,,,426,2.105737,48.332574
2021-1552334,2021-08-17,000001,Vente,250000,77,,RUE DE MEREVILLE,0280,91690,91533,Saclas,91,,,91533000AM0236,,,,,,,,,,,,,0,3,Dépendance,,0,S,sols,,,544,2.105599,48.332345
2021-1552334,2021-08-17,000001,Vente,250000,77,,RUE DE MEREVILLE,0280,91690,91533,Saclas,91,,,91533000AM0236,,,,,,,,,,,,,0,1,Maison,110,5,S,sols,,,544,2.105599,48.332345
2021-1552502,2021-08-12,000001,Vente,275000,17,,RUE DES NATIONS,0290,91690,91533,Saclas,91,,,91533000AB0070,,,,,,,,,,,,,0,3,Dépendance,,0,S,sols,,,967,2.145595,48.380122
2021-1552502,2021-08-12,000001,Vente,275000,17,,RUE DES NATIONS,0290,91690,91533,Saclas,91,,,91533000AB0070,,,,,,,,,,,,,0,1,Maison,74,4,S,sols,,,967,2.145595,48.380122
2021-1552555,2021-08-27,000001,Vente,170000,5,,RUE DES GRAVIERS,0100,91690,91533,Saclas,91,,,91533000AK0421,,,,,,,,,,,,,0,3,Dépendance,,0,S,sols,,,649,2.12135,48.354882
2021-1552555,2021-08-27,000001,Vente,170000,5,,RUE DES GRAVIERS,0100,91690,91533,Saclas,91,,,91533000AK0421,,,,,,,,,,,,,0,1,Maison,55,3,S,sols,,,649,2.12135,48.354882
2021-1552557,2021-08-24,000001,Vente,110000,1,B,PL DE L EGLISE,0070,91690,91533,Saclas,91,,,91533000AE0007,,,4,37.1,,,,,,,,,1,2,Appartement,37,2,,,,,,2.125303,48.361096
2021-1552636,2021-09-01,000001,Vente,125000,1,,RUE DE LA MAIRIE,0275,91690,91533,Saclas,91,,,91533000AE0042,,,1,,7,37.2,,,,,,,2,2,Appartement,41,2,,,,,,2.126349,48.360905
2021-1552636,2021-09-01,000001,Vente,125000,1,,RUE DE LA MAIRIE,0275,91690,91533,Saclas,91,,,91533000AE0042,,,9,,,,,,,,,,1,3,Dépendance,,0,,,,,,2.126349,48.360905
2021-1552637,2021-09-02,000001,Vente,215000,9,,RUE DU CREUX DE LA BORNE,0023,91690,91533,Saclas,91,,,91533000AE0354,,,,,,,,,,,,,0,1,Maison,55,3,S,sols,,,993,2.126581,48.356907
2021-1552637,2021-09-02,000001,Vente,215000,,,LE CREUX DE LA BORNE,B021,91690,91533,Saclas,91,,,91533000AE0355,,,,,,,,,,,,,0,,,,,BT,taillis simples,,,90,2.126353,48.356793
2021-1552648,2021-09-10,000001,Vente,130000,28,,RUE DES NATIONS,0290,91690,91533,Saclas,91,,,91533000AB0009,,,,,,,,,,,,,0,3,Dépendance,,0,S,sols,,,285,2.144609,48.381152
2021-1552648,2021-09-10,000001,Vente,130000,28,,RUE DES NATIONS,0290,91690,91533,Saclas,91,,,91533000AB0009,,,,,,,,,,,,,0,1,Maison,43,2,S,sols,,,285,2.144609,48.381152
2021-1552648,2021-09-10,000001,Vente,130000,,,HAM DE BIERVILLE,B044,91690,91533,Saclas,91,,,91533000AB0057,,,,,,,,,,,,,0,,,,,J,jardins,CRESS,Cressonnière,13,2.144523,48.381186
2021-1552648,2021-09-10,000001,Vente,130000,,,HAM DE BIERVILLE,B044,91690,91533,Saclas,91,,,91533000AB0071,,,,,,,,,,,,,0,,,,,J,jardins,CRESS,Cressonnière,732,2.144805,48.381244
2021-1552677,2021-04-28,000001,Vente,1,,,LES PRES DES LOUVERIES,B093,91690,91533,Saclas,91,,,91533000AH0093,,,,,,,,,,,,,0,,,,,BT,taillis simples,,,307,,
2021-1552728,2021-09-07,000001,Vente,264900,26,,RUE JULIEN BIDOCHON,0255,91690,91533,Saclas,91,,,91533000AK0745,,,,,,,,,,,,,0,3,Dépendance,,0,S,sols,,,1000,2.118389,48.356013
2021-1552728,2021-09-07,000001,Vente,264900,26,,RUE JULIEN BIDOCHON,0255,91690,91533,Saclas,91,,,91533000AK0745,,,,,,,,,,,,,0,1,Maison,106,4,S,sols,,,1000,2.118389,48.356013
2021-1552772,2021-09-08,000001,Vente,346410,20,,RUE DE LA LIBERATION,0265,91690,91533,Saclas,91,,,91533000AH0130,,,,,,,,,,,,,0,1,Maison,118,4,S,sols,,,500,2.116403,48.363267
2021-1552772,2021-09-08,000001,Vente,346410,20,,RUE DE LA LIBERATION,0265,91690,91533,Saclas,91,,,91533000AH0130,,,,,,,,,,,,,0,3,Dépendance,,0,AG,terrains d'agrément,PARC,Parc,1880,2.116403,48.363267
2021-1552772,2021-09-08,000001,Vente,346410,20,,RUE DE LA LIBERATION,0265,91690,91533,Saclas,91,,,91533000AH0130,,,,,,,,,,,,,0,3,Dépendance,,0,S,sols,,,500,2.116403,48.363267
2021-1552772,2021-09-08,000001,Vente,346410,20,,RUE DE LA LIBERATION,0265,91690,91533,Saclas,91,,,91533000AH0130,,,,,,,,,,,,,0,1,Maison,118,4,AG,terrains d'agrément,PARC,Parc,1880,2.116403,48.363267
2021-1552775,2021-09-22,000001,Vente,315000,,,LES PRES DES LOUVERIES,B093,91690,91533,Saclas,91,,,91533000AH0289,,,,,,,,,,,,,0,,,,,S,sols,,,32,2.113497,48.360627
2021-1552775,2021-09-22,000001,Vente,315000,48,,RUE DES LOUVERIES,0270,91690,91533,Saclas,91,,,91533000AH0313,,,,,,,,,,,,,0,1,Maison,136,6,AG,terrains d'agrément,PARC,Parc,2510,2.113553,48.361352
2021-1552775,2021-09-22,000001,Vente,315000,48,,RUE DES LOUVERIES,0270,91690,91533,Saclas,91,,,91533000AH0313,,,,,,,,,,,,,0,1,Maison,136,6,S,sols,,,500,2.113553,48.361352
2021-1552827,2021-09-21,000001,Vente,265000,4,,SENTE BOUDARD,B115,91690,91533,Saclas,91,,,91533000AE0326,,,,,,,,,,,,,0,1,Maison,117,4,S,sols,,,731,2.123161,48.359537
2021-1553019,2021-09-30,000001,Vente,87000,,,LE PRES DE SOUPLAINVILLE,B091,91690,91533,Saclas,91,,,91533000AI0141,,,,,,,,,,,,,0,,,,,S,sols,,,33,2.10965,48.361654
2021-1553019,2021-09-30,000001,Vente,87000,,,LE PRES DE SOUPLAINVILLE,B091,91690,91533,Saclas,91,,,91533000AI0142,,,,,,,,,,,,,0,,,,,AB,terrains a bâtir,,,1423,2.109852,48.361978