id_mutation,date_mutation,numero_disposition,nature_mutation,valeur_fonciere,adresse_numero,adresse_suffixe,adresse_nom_voie,adresse_code_voie,code_postal,code_commune,nom_commune,code_departement,ancien_code_commune,ancien_nom_commune,id_parcelle,ancien_id_parcelle,numero_volume,lot1_numero,lot1_surface_carrez,lot2_numero,lot2_surface_carrez,lot3_numero,lot3_surface_carrez,lot4_numero,lot4_surface_carrez,lot5_numero,lot5_surface_carrez,nombre_lots,code_type_local,type_local,surface_reelle_bati,nombre_pieces_principales,code_nature_culture,nature_culture,code_nature_culture_speciale,nature_culture_speciale,surface_terrain,longitude,latitude
2023-26161,2023-04-20,000001,Vente,300,,,LES VIGNES,B129,03190,03303,Venas,03,,,03303000AD0025,,,,,,,,,,,,,0,,,,,J,jardins,,,977,2.789731,46.494108
2023-26177,2023-04-20,000001,Vente,150,,,LA CHAIZE,B024,03190,03303,Venas,03,,,03303000AD0030,,,,,,,,,,,,,0,,,,,J,jardins,,,475,2.78772,46.493278
2023-26195,2023-04-20,000001,Vente,49700,,,LES TAILLEUX,B122,03190,03303,Venas,03,,,03303000AD0008,,,,,,,,,,,,,0,,,,,P,prés,,,6502,2.788225,46.491987
2023-26195,2023-04-20,000001,Vente,49700,,,LES VIGNES,B129,03190,03303,Venas,03,,,03303000AD0023,,,,,,,,,,,,,0,,,,,T,terres,,,8654,2.790663,46.493251
2023-26195,2023-04-20,000001,Vente,49700,,,LES VIGNES,B129,03190,03303,Venas,03,,,03303000AD0026,,,,,,,,,,,,,0,,,,,T,terres,,,7837,2.789646,46.493401
2023-26195,2023-04-20,000001,Vente,49700,,,LA CHAIZE,B024,03190,03303,Venas,03,,,03303000AD0031,,,,,,,,,,,,,0,,,,,J,jardins,,,1304,2.78784,46.494282
2023-26195,2023-04-20,000001,Vente,49700,,,LA CHAIZE,B024,03190,03303,Venas,03,,,03303000AD0032,,,,,,,,,,,,,0,,,,,S,sols,,,55,2.78776,46.494424
2023-26195,2023-04-20,000001,Vente,49700,,,LA CHAIZE,B024,03190,03303,Venas,03,,,03303000AD0052,,,,,,,,,,,,,0,,,,,T,terres,,,3504,2.789502,46.494697
2023-26195,2023-04-20,000001,Vente,49700,6,,RTE LA CHAISE,0073,03190,03303,Venas,03,,,03303000AD0053,,,,,,,,,,,,,0,1,Maison,70,2,S,sols,,,1419,2.789819,46.494406
2023-26195,2023-04-20,000001,Vente,49700,,,LA CHAIZE,B024,03190,03303,Venas,03,,,03303000AD0054,,,,,,,,,,,,,0,,,,,T,terres,,,3424,2.790301,46.494796
2023-26195,2023-04-20,000001,Vente,49700,,,LA CHAIZE,B024,03190,03303,Venas,03,,,03303000AD0054,,,,,,,,,,,,,0,,,,,S,sols,,,2943,2.790301,46.494796
2023-26195,2023-04-20,000001,Vente,49700,,,LA CHAIZE,B024,03190,03303,Venas,03,,,03303000AD0055,,,,,,,,,,,,,0,,,,,T,terres,,,7345,2.791472,46.494849
2023-26195,2023-04-20,000001,Vente,49700,,,LA CHAIZE,B024,03190,03303,Venas,03,,,03303000AD0055,,,,,,,,,,,,,0,,,,,S,sols,,,5,2.791472,46.494849
2023-26195,2023-04-20,000001,Vente,49700,,,LES CHAUMES D EN HAUT,B033,03190,03303,Venas,03,,,03303000AD0091,,,,,,,,,,,,,0,,,,,T,terres,,,9932,2.792557,46.494007
2023-26195,2023-04-20,000001,Vente,49700,,,LES CHAUMES D EN HAUT,B033,03190,03303,Venas,03,,,03303000AD0092,,,,,,,,,,,,,0,,,,,T,terres,,,8334,2.791649,46.493852
2023-26195,2023-04-20,000001,Vente,49700,,,LA CHAIZE,B024,03190,03303,Venas,03,,,03303000AD0135,,,,,,,,,,,,,0,,,,,P,prés,,,14542,2.788426,46.494065
2023-26408,2023-05-10,000001,Vente,153000,,,LES LANDES,B084,03190,03303,Venas,03,,,03303000BC0051,,,,,,,,,,,,,0,,,,,T,terres,,,39043,2.786934,46.445353
2023-26408,2023-05-10,000001,Vente,153000,,,LES ECHEROLLES,B050,03190,03303,Venas,03,,,03303000BC0052,,,,,,,,,,,,,0,,,,,T,terres,,,38942,2.783352,46.445777
2023-26408,2023-05-10,000001,Vente,153000,,,LES ECHEROLLES,B050,03190,03303,Venas,03,,,03303000BC0053,,,,,,,,,,,,,0,,,,,T,terres,,,37700,2.781472,46.446285
2023-26978,2023-05-30,000001,Vente,580000,,,LE BOURG,B012,03190,03303,Venas,03,,,03303000AR0059,,,,,,,,,,,,,0,,,,,P,prés,,,4403,2.764338,46.474118
2023-26978,2023-05-30,000001,Vente,580000,,,LE BOURG,B012,03190,03303,Venas,03,,,03303000AR0061,,,,,,,,,,,,,0,,,,,AG,terrains d'agrément,,,800,2.764938,46.474175
2023-26978,2023-05-30,000001,Vente,580000,,,LE BOURG,B012,03190,03303,Venas,03,,,03303000AR0062,,,,,,,,,,,,,0,,,,,AG,terrains d'agrément,,,7087,2.76518,46.474639
2023-26978,2023-05-30,000001,Vente,580000,,,LE BOURG,B012,03190,03303,Venas,03,,,03303000AR0063,,,,,,,,,,,,,0,,,,,T,terres,,,1619,2.764356,46.474736
2023-26978,2023-05-30,000001,Vente,580000,,,LE BOURG,B012,03190,03303,Venas,03,,,03303000AR0064,,,,,,,,,,,,,0,,,,,J,jardins,,,1856,2.764125,46.474677
2023-26978,2023-05-30,000001,Vente,580000,,,LE BOURG,B012,03190,03303,Venas,03,,,03303000AR0065,,,,,,,,,,,,,0,,,,,T,terres,,,1489,2.763762,46.474581
2023-26978,2023-05-30,000001,Vente,580000,,,LE BOURG,B012,03190,03303,Venas,03,,,03303000AR0066,,,,,,,,,,,,,0,,,,,AG,terrains d'agrément,,,1749,2.764072,46.475294
2023-26978,2023-05-30,000001,Vente,580000,,,LE BOURG,B012,03190,03303,Venas,03,,,03303000AR0067,,,,,,,,,,,,,0,,,,,AG,terrains d'agrément,,,1731,2.764742,46.475296
2023-26978,2023-05-30,000001,Vente,580000,,,LE BOURG,B012,03190,03303,Venas,03,,,03303000AR0068,,,,,,,,,,,,,0,,,,,S,sols,,,922,2.765478,46.475224
2023-26978,2023-05-30,000001,Vente,580000,,,LE BOURG,B012,03190,03303,Venas,03,,,03303000AR0069,,,,,,,,,,,,,0,,,,,AG,terrains d'agrément,,,994,2.764886,46.475482
2023-26978,2023-05-30,000001,Vente,580000,,,LE BOURG,B012,03190,03303,Venas,03,,,03303000AR0070,,,,,,,,,,,,,0,,,,,AG,terrains d'agrément,,,1439,2.764482,46.475695
2023-26978,2023-05-30,000001,Vente,580000,3,,PL JOSEPH SANLIAS,0070,03190,03303,Venas,03,,,03303000AR0071,,,,,,,,,,,,,0,1,Maison,90,2,S,sols,,,2337,2.764669,46.475796
2023-26978,2023-05-30,000001,Vente,580000,,,LE BOURG,B012,03190,03303,Venas,03,,,03303000AR0076,,,,,,,,,,,,,0,,,,,S,sols,,,36,2.765052,46.475966
2023-26978,2023-05-30,000001,Vente,580000,1,,PL JOSEPH SANLIAS,0070,03190,03303,Venas,03,,,03303000AR0077,,,,,,,,,,,,,0,3,Dépendance,,0,S,sols,,,1038,2.765364,46.475645
2023-26978,2023-05-30,000001,Vente,580000,1,,PL JOSEPH SANLIAS,0070,03190,03303,Venas,03,,,03303000AR0077,,,,,,,,,,,,,0,3,Dépendance,,0,S,sols,,,1038,2.765364,46.475645
2023-26978,2023-05-30,000001,Vente,580000,1,,PL JOSEPH SANLIAS,0070,03190,03303,Venas,03,,,03303000AR0077,,,,,,,,,,,,,0,1,Maison,200,7,S,sols,,,1038,2.765364,46.475645
2023-26978,2023-05-30,000001,Vente,580000,,,LE BOURG,B012,03190,03303,Venas,03,,,03303000AR0078,,,,,,,,,,,,,0,,,,,AG,terrains d'agrément,,,19544,2.765903,46.475256
2023-26978,2023-05-30,000001,Vente,580000,,,LE BOURG,B012,03190,03303,Venas,03,,,03303000AR0131,,,,,,,,,,,,,0,,,,,E,eaux,MARE,Mare,1186,2.765347,46.475598
2023-29871,2023-10-06,000001,Vente,5000,,,LE BOURG,B012,03190,03303,Venas,03,,,03303000AR0021,,,,,,,,,,,,,0,,,,,T,terres,,,5632,2.763856,46.477874
2023-29871,2023-10-06,000001,Vente,5000,,,LE BOURG,B012,03190,03303,Venas,03,,,03303000AR0027,,,,,,,,,,,,,0,,,,,T,terres,,,4740,2.763263,46.477207
2023-29871,2023-10-06,000001,Vente,5000,,,LE BOURG,B012,03190,03303,Venas,03,,,03303000AR0027,,,,,,,,,,,,,0,,,,,S,sols,,,250,2.763263,46.477207
2023-31634,2023-12-30,000001,Vente,33000,,,LES BROCHETIERES,B017,03190,03303,Venas,03,,,03303000AZ0042,,,,,,,,,,,,,0,,,,,T,terres,,,7972,2.785868,46.456746
2023-31634,2023-12-30,000001,Vente,33000,,,LES BROCHETIERES,B017,03190,03303,Venas,03,,,03303000AZ0043,,,,,,,,,,,,,0,,,,,P,prés,,,7842,2.785782,46.457672
2023-31634,2023-12-30,000001,Vente,33000,,,LES BROCHETIERES,B017,03190,03303,Venas,03,,,03303000AZ0044,,,,,,,,,,,,,0,,,,,T,terres,,,9827,2.785865,46.458489
2023-31634,2023-12-30,000001,Vente,33000,,,LES BROCHETIERES,B017,03190,03303,Venas,03,,,03303000AZ0045,,,,,,,,,,,,,0,,,,,P,prés,,,8747,2.787253,46.457215
2023-31634,2023-12-30,000001,Vente,33000,,,LES BROCHETIERES,B017,03190,03303,Venas,03,,,03303000AZ0046,,,,,,,,,,,,,0,,,,,S,sols,,,1407,2.787316,46.45667
2023-31634,2023-12-30,000001,Vente,33000,,,LES BROCHETIERES,B017,03190,03303,Venas,03,,,03303000AZ0055,,,,,,,,,,,,,0,,,,,J,jardins,,,375,2.787697,46.456685
2023-31634,2023-12-30,000001,Vente,33000,5,,RTE LES BROCHETIERES,0086,03190,03303,Venas,03,,,03303000AZ0056,,,,,,,,,,,,,0,4,Local industriel. commercial ou assimilé,30,0,T,terres,,,4100,2.787967,46.457284
2023-31634,2023-12-30,000001,Vente,33000,5,,RTE LES BROCHETIERES,0086,03190,03303,Venas,03,,,03303000AZ0056,,,,,,,,,,,,,0,4,Local industriel. commercial ou assimilé,30,0,S,sols,,,32,2.787967,46.457284
