id_mutation,date_mutation,numero_disposition,nature_mutation,valeur_fonciere,adresse_numero,adresse_suffixe,adresse_nom_voie,adresse_code_voie,code_postal,code_commune,nom_commune,code_departement,ancien_code_commune,ancien_nom_commune,id_parcelle,ancien_id_parcelle,numero_volume,lot1_numero,lot1_surface_carrez,lot2_numero,lot2_surface_carrez,lot3_numero,lot3_surface_carrez,lot4_numero,lot4_surface_carrez,lot5_numero,lot5_surface_carrez,nombre_lots,code_type_local,type_local,surface_reelle_bati,nombre_pieces_principales,code_nature_culture,nature_culture,code_nature_culture_speciale,nature_culture_speciale,surface_terrain,longitude,latitude
2023-178913,2023-01-28,000001,Vente,65000,4,,RUE MAIN GAUCHE,0180,15200,15079,Jaleyrac,15,,,15079000ZL0107,,,,,,,,,,,,,0,1,Maison,69,5,J,jardins,,,821,2.35991,45.266105
2023-178913,2023-01-28,000001,Vente,65000,4,,RUE MAIN GAUCHE,0180,15200,15079,Jaleyrac,15,,,15079000ZL0107,,,,,,,,,,,,,0,1,Maison,69,5,S,sols,,,821,2.35991,45.266105
2023-178913,2023-01-28,000001,Vente,65000,4,,RUE MAIN GAUCHE,0180,15200,15079,Jaleyrac,15,,,15079000ZL0107,,,,,,,,,,,,,0,1,Maison,69,5,PA,pâtures,,,3017,2.35991,45.266105
2023-179071,2023-02-16,000001,Vente,10000,5037,,LA GARE,B054,15200,15079,Jaleyrac,15,,,15079000ZM0063,,,,,,,,,,,,,0,1,Maison,32,2,S,sols,,,84,2.36381,45.27403
2023-179071,2023-02-16,000001,Vente,10000,5037,,LA GARE,B054,15200,15079,Jaleyrac,15,,,15079000ZM0063,,,,,,,,,,,,,0,1,Maison,32,2,T,terres,,,9436,2.36381,45.27403
2023-179071,2023-02-16,000001,Vente,10000,5037,,LA GARE,B054,15200,15079,Jaleyrac,15,,,15079000ZM0063,,,,,,,,,,,,,0,3,Dépendance,,0,T,terres,,,9436,2.36381,45.27403
2023-179071,2023-02-16,000001,Vente,10000,5037,,LA GARE,B054,15200,15079,Jaleyrac,15,,,15079000ZM0063,,,,,,,,,,,,,0,3,Dépendance,,0,S,sols,,,84,2.36381,45.27403
2023-179071,2023-02-16,000001,Vente,10000,,,LA GARE,B054,15200,15079,Jaleyrac,15,,,15079000ZM0108,,,,,,,,,,,,,0,,,,,T,terres,,,12560,2.363772,45.275745
2023-179071,2023-02-16,000001,Vente,10000,,,LA GARE,B054,15200,15079,Jaleyrac,15,,,15079000ZM0177,,,,,,,,,,,,,0,,,,,BT,taillis simples,,,5770,2.360426,45.275291
2023-179142,2023-02-27,000001,Vente,215,,,ETANG DE LAVAURS,B102,15200,15079,Jaleyrac,15,,,15079000AA0052,,,,,,,,,,,,,0,,,,,L,landes,BRUY,Bruyère,57,2.34754,45.25645
2023-179235,2023-02-27,000001,Vente,10368,,,ETANG DE LAVAURS,B102,15200,15079,Jaleyrac,15,,,15079000AA0079,,,,,,,,,,,,,0,,,,,AB,terrains a bâtir,,,864,2.348053,45.255783
2023-179468,2023-03-29,000001,Vente,70000,,,LES CHAMPS GRANDS,B024,15200,15079,Jaleyrac,15,,,15079000ZK0128,,,,,,,,,,,,,0,,,,,S,sols,,,3055,2.340495,45.266911
2023-179575,2023-03-29,000001,Vente,6608,,,LES CHAMPS GRANDS,B024,15200,15079,Jaleyrac,15,,,15079000ZK0108,,,,,,,,,,,,,0,,,,,S,sols,,,345,2.340583,45.267201
2023-179576,2023-03-29,000001,Vente,450000,,,LES CHAMPS,B023,15200,15079,Jaleyrac,15,,,15079000ZK0085,,,,,,,,,,,,,0,,,,,PA,pâtures,,,1361,2.341346,45.26626
2023-179576,2023-03-29,000001,Vente,450000,5,,RUE DES GRANDS CHAMPS,0125,15200,15079,Jaleyrac,15,,,15079000ZK0107,,,,,,,,,,,,,0,4,Local industriel. commercial ou assimilé,1900,0,S,sols,,,3286,2.340934,45.266839
2023-179576,2023-03-29,000001,Vente,450000,,,LES CHAMPS GRANDS,B024,15200,15079,Jaleyrac,15,,,15079000ZK0110,,,,,,,,,,,,,0,,,,,PA,pâtures,,,97,2.340889,45.266694
2023-179576,2023-03-29,000001,Vente,450000,,,LES CHAMPS GRANDS,B024,15200,15079,Jaleyrac,15,,,15079000ZK0128,,,,,,,,,,,,,0,,,,,S,sols,,,3055,2.340495,45.266911
2023-179595,2023-04-06,000001,Vente,30000,,,FROMENTAL EST,B053,15200,15079,Jaleyrac,15,,,15079000ZB0036,,,,,,,,,,,,,0,,,,,PA,pâtures,,,2800,2.385646,45.275412
2023-179595,2023-04-06,000001,Vente,30000,,,FROMENTAL EST,B053,15200,15079,Jaleyrac,15,,,15079000ZB0037,,,,,,,,,,,,,0,,,,,PA,pâtures,,,12734,2.386209,45.276001
2023-179595,2023-04-06,000001,Vente,30000,,,FROMENTAL EST,B053,15200,15079,Jaleyrac,15,,,15079000ZB0037,,,,,,,,,,,,,0,,,,,PA,pâtures,,,25466,2.386209,45.276001
2023-180418,2023-06-01,000001,Vente,30000,,,LES FRAUX OUEST,B051,15200,15079,Jaleyrac,15,,,15079000ZK0027,,,,,,,,,,,,,0,,,,,PA,pâtures,,,27769,2.360225,45.268207
2023-180418,2023-06-01,000001,Vente,30000,,,LES FRAUX OUEST,B051,15200,15079,Jaleyrac,15,,,15079000ZK0027,,,,,,,,,,,,,0,,,,,S,sols,,,151,2.360225,45.268207
2023-180418,2023-06-01,000001,Vente,30000,,,LES FRAUX OUEST,B051,15200,15079,Jaleyrac,15,,,15079000ZK0052,,,,,,,,,,,,,0,,,,,T,terres,,,8411,2.358267,45.266462
2023-180418,2023-06-01,000001,Vente,30000,,,LES FRAUX OUEST,B051,15200,15079,Jaleyrac,15,,,15079000ZK0052,,,,,,,,,,,,,0,,,,,P,prés,,,17724,2.358267,45.266462
2023-180418,2023-06-01,000001,Vente,30000,,,LES FRAUX OUEST,B051,15200,15079,Jaleyrac,15,,,15079000ZK0154,,,,,,,,,,,,,0,,,,,PA,pâtures,,,5681,2.361417,45.269675
2023-180418,2023-06-01,000001,Vente,30000,,,LES FRAUX OUEST,B051,15200,15079,Jaleyrac,15,,,15079000ZK0154,,,,,,,,,,,,,0,,,,,T,terres,,,9753,2.361417,45.269675
2023-180418,2023-06-01,000001,Vente,30000,5,,RUE DE LA GARE,0170,15200,15079,Jaleyrac,15,,,15079000ZK0156,,,,,,,,,,,,,0,,,,,S,sols,,,193,2.361662,45.268717
2023-180736,2023-07-19,000001,Vente,108000,6,,RUE DES FOUGERES,0160,15200,15079,Jaleyrac,15,,,15079000AA0045,,,,,,,,,,,,,0,1,Maison,106,3,S,sols,,,771,2.346935,45.254878
2023-180929,2023-08-07,000001,Vente,128150,2,,RUE DES GENETS,0175,15200,15079,Jaleyrac,15,,,15079000AA0034,,,,,,,,,,,,,0,1,Maison,87,4,S,sols,,,855,2.34706,45.253983
2023-180976,2023-08-10,000001,Vente,45000,16,,RUE DES PUITS,0195,15200,15079,Jaleyrac,15,,,15079000ZB0149,,,,,,,,,,,,,0,1,Maison,78,3,S,sols,,,228,2.380295,45.275304
2023-181176,2023-08-30,000001,Vente,1000,,,BOURIANNES,B014,15200,15079,Jaleyrac,15,,,15079000ZI0119,,,,,,,,,,,,,0,,,,,P,prés,,,336,2.345402,45.264154
2023-181195,2023-09-06,000001,Vente,13572,,,ETANG DE LAVAURS,B102,15200,15079,Jaleyrac,15,,,15079000AA0083,,,,,,,,,,,,,0,,,,,AB,terrains a bâtir,,,1131,2.34824,45.25632
2023-181254,2023-09-11,000001,Vente,118300,,,LES FRAUX,B050,15200,15079,Jaleyrac,15,,,15079000ZK0093,,,,,,,,,,,,,0,,,,,T,terres,,,9920,2.357947,45.272681
2023-181254,2023-09-11,000001,Vente,118300,,,LES FRAUX,B050,15200,15079,Jaleyrac,15,,,15079000ZK0095,,,,,,,,,,,,,0,,,,,PA,pâtures,,,5280,2.359145,45.272691
2023-181254,2023-09-11,000001,Vente,118300,,,LA GARE,B054,15200,15079,Jaleyrac,15,,,15079000ZM0184,,,,,,,,,,,,,0,,,,,BT,taillis simples,,,4880,2.359406,45.273275
2023-181390,2023-09-25,000001,Vente,52800,,,LES CHAMPS NORD,B026,15200,15079,Jaleyrac,15,,,15079000ZA0101,,,,,,,,,,,,,0,,,,,P,prés,,,65,2.363878,45.291105
2023-181390,2023-09-25,000001,Vente,52800,,,EMBRASSAC,B039,15200,15079,Jaleyrac,15,,,15079000ZA0166,,,,,,,,,,,,,0,,,,,S,sols,,,76,2.363991,45.291077
2023-181390,2023-09-25,000001,Vente,52800,21,,RUE DES CHATAIGNIERS,0130,15200,15079,Jaleyrac,15,,,15079000ZA0178,,,,,,,,,,,,,0,1,Maison,50,2,S,sols,,,157,2.36398,45.291017
2023-181390,2023-09-25,000001,Vente,52800,,,LES CHAMPS NORD,B026,15200,15079,Jaleyrac,15,,,15079000ZA0219,,,,,,,,,,,,,0,,,,,J,jardins,,,746,2.363855,45.290987
2023-181421,2023-09-04,000002,Echange,150,,,BOURIANNES,B014,15200,15079,Jaleyrac,15,,,15079000ZI0218,,,,,,,,,,,,,0,,,,,PA,pâtures,,,61,,
2023-181421,2023-09-04,000003,Echange,150,10,,RUE DES PRES GRANDS,0190,15200,15079,Jaleyrac,15,,,15079000ZI0220,,,,,,,,,,,,,0,,,,,S,sols,,,61,,
2023-182069,2023-11-23,000001,Vente,115000,10,,RUE DES CHATAIGNIERS,0130,15200,15079,Jaleyrac,15,,,15079000ZA0157,,,,,,,,,,,,,0,3,Dépendance,,0,S,sols,,,195,2.364281,45.288675
2023-182069,2023-11-23,000001,Vente,115000,10,,RUE DES CHATAIGNIERS,0130,15200,15079,Jaleyrac,15,,,15079000ZA0157,,,,,,,,,,,,,0,3,Dépendance,,0,S,sols,,,195,2.364281,45.288675
2023-182069,2023-11-23,000001,Vente,115000,10,,RUE DES CHATAIGNIERS,0130,15200,15079,Jaleyrac,15,,,15079000ZA0157,,,,,,,,,,,,,0,1,Maison,100,4,S,sols,,,195,2.364281,45.288675
2023-182069,2023-11-23,000001,Vente,115000,,,EMBRASSAC,B039,15200,15079,Jaleyrac,15,,,15079000ZA0158,,,,,,,,,,,,,0,,,,,S,sols,,,100,2.364435,45.288411
2023-182069,2023-11-23,000001,Vente,115000,,,EMBRASSAC,B039,15200,15079,Jaleyrac,15,,,15079000ZA0158,,,,,,,,,,,,,0,,,,,J,jardins,,,1100,2.364435,45.288411
2023-182069,2023-11-23,000001,Vente,115000,,,EMBRASSAC,B039,15200,15079,Jaleyrac,15,,,15079000ZA0195,,,,,,,,,,,,,0,,,,,P,prés,,,66,2.364294,45.288783
2023-182069,2023-11-23,000001,Vente,115000,,,EMBRASSAC,B039,15200,15079,Jaleyrac,15,,,15079000ZA0197,,,,,,,,,,,,,0,,,,,P,prés,,,153,2.364398,45.288637
