id_mutation,date_mutation,numero_disposition,nature_mutation,valeur_fonciere,adresse_numero,adresse_suffixe,adresse_nom_voie,adresse_code_voie,code_postal,code_commune,nom_commune,code_departement,ancien_code_commune,ancien_nom_commune,id_parcelle,ancien_id_parcelle,numero_volume,lot1_numero,lot1_surface_carrez,lot2_numero,lot2_surface_carrez,lot3_numero,lot3_surface_carrez,lot4_numero,lot4_surface_carrez,lot5_numero,lot5_surface_carrez,nombre_lots,code_type_local,type_local,surface_reelle_bati,nombre_pieces_principales,code_nature_culture,nature_culture,code_nature_culture_speciale,nature_culture_speciale,surface_terrain,longitude,latitude
2023-178671,2023-01-03,000001,Vente,232500,2,,HAMEAU DES 4 ROUTES,0190,15250,15160,Reilhac,15,,,15160000AA0310,,,,,,,,,,,,,0,1,Maison,111,6,S,sols,,,643,2.405705,44.950847
2023-178774,2023-01-06,000001,Vente,61000,,,LE REMBLAI,B023,15250,15160,Reilhac,15,,,15160000AC0193,,,,,,,,,,,,,0,,,,,P,prés,,,12299,2.410497,44.971086
2023-178830,2023-01-24,000001,Vente,309500,4,,HAMEAU DE LACANE,0287,15250,15160,Reilhac,15,,,15160000AA0276,,,,,,,,,,,,,0,1,Maison,144,6,S,sols,,,500,2.404992,44.953147
2023-178830,2023-01-24,000001,Vente,309500,4,,HAMEAU DE LACANE,0287,15250,15160,Reilhac,15,,,15160000AA0276,,,,,,,,,,,,,0,1,Maison,144,6,AG,terrains d'agrément,,,1521,2.404992,44.953147
2023-179109,2023-02-23,000001,Vente,90000,,,ONSAC,B019,15250,15160,Reilhac,15,,,15160000AM0025,,,,,,,,,,,,,0,,,,,L,landes,,,2321,2.44394,44.980962
2023-179109,2023-02-23,000001,Vente,90000,,,ONSAC,B019,15250,15160,Reilhac,15,,,15160000AM0025,,,,,,,,,,,,,0,,,,,T,terres,,,121128,2.44394,44.980962
2023-179109,2023-02-23,000001,Vente,90000,,,ONSAC,B019,15250,15160,Reilhac,15,,,15160000AM0025,,,,,,,,,,,,,0,,,,,BT,taillis simples,,,1020,2.44394,44.980962
2023-179109,2023-02-23,000001,Vente,90000,,,ONSAC,B019,15250,15160,Reilhac,15,,,15160000AM0025,,,,,,,,,,,,,0,,,,,L,landes,,,2645,2.44394,44.980962
2023-179109,2023-02-23,000001,Vente,90000,,,LAVAISSIERE,B014,15250,15160,Reilhac,15,,,15160000AM0065,,,,,,,,,,,,,0,,,,,L,landes,,,2080,2.444034,44.979828
2023-179109,2023-02-23,000001,Vente,90000,,,LAVAISSIERE,B014,15250,15160,Reilhac,15,,,15160000AM0085,,,,,,,,,,,,,0,,,,,L,landes,,,3471,2.443223,44.978193
2023-179109,2023-02-23,000001,Vente,90000,,,LAVAISSIERE,B014,15250,15160,Reilhac,15,,,15160000AM0087,,,,,,,,,,,,,0,,,,,L,landes,,,18746,2.44293,44.978752
2023-179109,2023-02-23,000001,Vente,90000,,,LAVAISSIERE,B014,15250,15160,Reilhac,15,,,15160000AM0087,,,,,,,,,,,,,0,,,,,PA,pâtures,,,19217,2.44293,44.978752
2023-179109,2023-02-23,000001,Vente,90000,,,LAVAISSIERE,B014,15250,15160,Reilhac,15,,,15160000AM0087,,,,,,,,,,,,,0,,,,,PA,pâtures,,,8771,2.44293,44.978752
2023-179109,2023-02-23,000001,Vente,90000,,,LAVAISSIERE,B014,15250,15160,Reilhac,15,,,15160000AM0087,,,,,,,,,,,,,0,,,,,L,landes,,,9108,2.44293,44.978752
2023-179109,2023-02-23,000001,Vente,90000,,,LAVAISSIERE,B014,15250,15160,Reilhac,15,,,15160000AM0087,,,,,,,,,,,,,0,,,,,PA,pâtures,,,19217,2.44293,44.978752
2023-179109,2023-02-23,000001,Vente,90000,,,LAVAISSIERE,B014,15250,15160,Reilhac,15,,,15160000AM0087,,,,,,,,,,,,,0,,,,,PA,pâtures,,,18357,2.44293,44.978752
2023-179110,2023-02-10,000001,Vente,202000,6,,ALL DES COLIBRIS,0230,15250,15160,Reilhac,15,,,15160000AD0185,,,,,,,,,,,,,0,1,Maison,95,4,S,sols,,,823,2.414005,44.973861
2023-179504,2023-03-16,000001,Vente,169000,20,,RTE IMPERIALE,0530,15250,15160,Reilhac,15,,,15160000AE0077,,,,,,,,,,,,,0,1,Maison,88,5,S,sols,,,870,2.419277,44.976326
2023-179504,2023-03-16,000001,Vente,169000,20,,RTE IMPERIALE,0530,15250,15160,Reilhac,15,,,15160000AE0077,,,,,,,,,,,,,0,3,Dépendance,,0,S,sols,,,870,2.419277,44.976326
2023-179696,2023-03-31,000001,Vente,95000,4,,RUE DES ORCHIDEES,0340,15250,15160,Reilhac,15,,,15160000AD0038,,,,,,,,,,,,,0,1,Maison,69,4,S,sols,,,624,2.417304,44.97508
2023-180430,2023-06-16,000001,Vente,98000,,,LESTOUBEYRE EST,B016,15250,15160,Reilhac,15,,,15160000AH0015,,,,,,,,,,,,,0,,,,,S,sols,,,58,2.417739,44.971611
2023-180430,2023-06-16,000001,Vente,98000,3,,RUE DE LESTOUBEYRE,0075,15250,15160,Reilhac,15,,,15160000AH0016,,,,,,,,,,,,,0,3,Dépendance,,0,S,sols,,,610,2.41772,44.971509
2023-180430,2023-06-16,000001,Vente,98000,3,,RUE DE LESTOUBEYRE,0075,15250,15160,Reilhac,15,,,15160000AH0016,,,,,,,,,,,,,0,1,Maison,65,4,S,sols,,,610,2.41772,44.971509
2023-180430,2023-06-16,000001,Vente,98000,,,LESTOUBEYRE EST,B016,15250,15160,Reilhac,15,,,15160000AH0017,,,,,,,,,,,,,0,,,,,PA,pâtures,,,399,2.418024,44.971504
2023-180600,2023-06-16,000001,Vente,470700,2,,IMP DES ROCS,0380,15250,15160,Reilhac,15,,,15160000AE0037,,,,,,,,,,,,,0,1,Maison,215,8,S,sols,,,800,2.422162,44.973966
2023-180600,2023-06-16,000001,Vente,470700,2,,IMP DES ROCS,0380,15250,15160,Reilhac,15,,,15160000AE0037,,,,,,,,,,,,,0,3,Dépendance,,0,S,sols,,,800,2.422162,44.973966
2023-180600,2023-06-16,000001,Vente,470700,2,,IMP DES ROCS,0380,15250,15160,Reilhac,15,,,15160000AE0037,,,,,,,,,,,,,0,3,Dépendance,,0,AG,terrains d'agrément,,,286,2.422162,44.973966
2023-180600,2023-06-16,000001,Vente,470700,2,,IMP DES ROCS,0380,15250,15160,Reilhac,15,,,15160000AE0037,,,,,,,,,,,,,0,3,Dépendance,,0,AG,terrains d'agrément,,,286,2.422162,44.973966
2023-180600,2023-06-16,000001,Vente,470700,2,,IMP DES ROCS,0380,15250,15160,Reilhac,15,,,15160000AE0037,,,,,,,,,,,,,0,1,Maison,215,8,AG,terrains d'agrément,,,286,2.422162,44.973966
2023-180600,2023-06-16,000001,Vente,470700,2,,IMP DES ROCS,0380,15250,15160,Reilhac,15,,,15160000AE0037,,,,,,,,,,,,,0,3,Dépendance,,0,S,sols,,,800,2.422162,44.973966
2023-180600,2023-06-16,000001,Vente,470700,,,LE BOURG,B001,15250,15160,Reilhac,15,,,15160000AE0038,,,,,,,,,,,,,0,,,,,AG,terrains d'agrément,,,1594,2.422349,44.973671
2023-180600,2023-06-16,000001,Vente,470700,,,LE BOURG,B001,15250,15160,Reilhac,15,,,15160000AE0040,,,,,,,,,,,,,0,,,,,S,sols,,,200,2.422347,44.974104
2023-180600,2023-06-16,000001,Vente,470700,,,LE BOURG,B001,15250,15160,Reilhac,15,,,15160000AE0040,,,,,,,,,,,,,0,,,,,AG,terrains d'agrément,,,1029,2.422347,44.974104
2023-180600,2023-06-16,000001,Vente,470700,,,LE BOURG,B001,15250,15160,Reilhac,15,,,15160000AE0041,,,,,,,,,,,,,0,,,,,BT,taillis simples,,,1402,2.422066,44.974391
2023-180647,2023-07-11,000001,Vente,188000,2,,RUE DES POMMIERS,0360,15250,15160,Reilhac,15,,,15160000AD0146,,,,,,,,,,,,,0,1,Maison,76,3,S,sols,,,1000,2.411172,44.972446
2023-180647,2023-07-11,000001,Vente,188000,2,,RUE DES POMMIERS,0360,15250,15160,Reilhac,15,,,15160000AD0146,,,,,,,,,,,,,0,1,Maison,76,3,J,jardins,,,988,2.411172,44.972446
2023-180647,2023-07-11,000001,Vente,188000,2,,RUE DES POMMIERS,0360,15250,15160,Reilhac,15,,,15160000AD0146,,,,,,,,,,,,,0,3,Dépendance,,0,J,jardins,,,988,2.411172,44.972446
2023-180647,2023-07-11,000001,Vente,188000,2,,RUE DES POMMIERS,0360,15250,15160,Reilhac,15,,,15160000AD0146,,,,,,,,,,,,,0,3,Dépendance,,0,S,sols,,,1000,2.411172,44.972446
2023-180690,2023-07-06,000001,Vente,115000,9,,RUE DES GRANGES,0275,15250,15160,Reilhac,15,,,15160000AO0004,,,,,,,,,,,,,0,3,Dépendance,,0,J,jardins,,,733,2.442896,44.972349
2023-180690,2023-07-06,000001,Vente,115000,9,,RUE DES GRANGES,0275,15250,15160,Reilhac,15,,,15160000AO0004,,,,,,,,,,,,,0,3,Dépendance,,0,S,sols,,,254,2.442896,44.972349
2023-180690,2023-07-06,000001,Vente,115000,9,,RUE DES GRANGES,0275,15250,15160,Reilhac,15,,,15160000AO0004,,,,,,,,,,,,,0,1,Maison,100,3,S,sols,,,254,2.442896,44.972349
2023-180690,2023-07-06,000001,Vente,115000,9,,RUE DES GRANGES,0275,15250,15160,Reilhac,15,,,15160000AO0004,,,,,,,,,,,,,0,1,Maison,100,3,J,jardins,,,733,2.442896,44.972349
2023-181044,2023-08-08,000001,Vente,46000,,,LESTOUBEYRE,B015,15250,15160,Reilhac,15,,,15160000AI0028,,,,,,,,,,,,,0,,,,,P,prés,,,2627,2.41475,44.971637
2023-181137,2023-08-18,000002,Vente,1,6,,RUE DES AUBEPINES,0160,15250,15160,Reilhac,15,,,15160000AC0198,,,,,,,,,,,,,0,3,Dépendance,,0,,,,,,,
2023-181137,2023-08-18,000002,Vente,1,6,,RUE DES AUBEPINES,0160,15250,15160,Reilhac,15,,,15160000AC0198,,,,,,,,,,,,,0,1,Maison,105,5,,,,,,,
2023-181413,2023-09-16,000001,Vente,140000,1,,RUE DES ORCHIDEES,0340,15250,15160,Reilhac,15,,,15160000AD0010,,,,,,,,,,,,,0,1,Maison,69,4,S,sols,,,786,2.4163,44.975475
2023-181768,2023-10-20,000002,Vente,1,,,CITE DES LANDES,A020,15250,15160,Reilhac,15,,,15160000AD0209,,,,,,,,,,,,,0,,,,,AB,terrains a bâtir,RUE,Rue,315,,
2023-181769,2023-10-21,000001,Vente,138510,14,,RTE IMPERIALE,0530,15250,15160,Reilhac,15,,,15160000AE0074,,,,,,,,,,,,,0,1,Maison,86,4,S,sols,,,660,2.418745,44.975835
2023-181926,2023-11-09,000001,Vente,90000,1,,RUE DES GLYCINES,0270,15250,15160,Reilhac,15,,,15160000AD0070,,,,,,,,,,,,,0,1,Maison,83,5,S,sols,,,539,2.417695,44.974347
2023-182015,2023-11-16,000001,Vente,110000,11,,RUE DES GLYCINES,0270,15250,15160,Reilhac,15,,,15160000AD0065,,,,,,,,,,,,,0,1,Maison,83,5,S,sols,,,626,2.416496,44.974171
2023-182275,2023-12-08,000001,Vente,119200,3,,RUE DES MYOSOTIS,0320,15250,15160,Reilhac,15,,,15160000AD0040,,,,,,,,,,,,,0,1,Maison,86,4,S,sols,,,575,2.416885,44.975655
