id_mutation,date_mutation,numero_disposition,nature_mutation,valeur_fonciere,adresse_numero,adresse_suffixe,adresse_nom_voie,adresse_code_voie,code_postal,code_commune,nom_commune,code_departement,ancien_code_commune,ancien_nom_commune,id_parcelle,ancien_id_parcelle,numero_volume,lot1_numero,lot1_surface_carrez,lot2_numero,lot2_surface_carrez,lot3_numero,lot3_surface_carrez,lot4_numero,lot4_surface_carrez,lot5_numero,lot5_surface_carrez,nombre_lots,code_type_local,type_local,surface_reelle_bati,nombre_pieces_principales,code_nature_culture,nature_culture,code_nature_culture_speciale,nature_culture_speciale,surface_terrain,longitude,latitude
2023-206286,2023-02-02,000001,Vente,20000,,,DEVANT CHEZ BOUIN,B031,17500,17006,Allas-Champagne,17,,,17006000ZL0150,,,,,,,,,,,,,0,,,,,AB,terrains a bâtir,,,1216,-0.335208,45.460951
2023-207336,2023-03-24,000001,Vente,1,,,CHEZ GENDRE,B036,17500,17006,Allas-Champagne,17,,,17006000ZH0063,,,,,,,,,,,,,0,,,,,S,sols,,,26,-0.330941,45.479213
2023-209289,2023-06-13,000001,Vente,145000,,,LES PLANTES D ALLAS,B070,17500,17006,Allas-Champagne,17,,,17006000ZI0068,,,,,,,,,,,,,0,,,,,VI,vignes,,,16274,-0.32278,45.469303
2023-213429,2023-12-13,000002,Echange,1059,,,LES PLANTES D ALLAS,B070,17500,17006,Allas-Champagne,17,,,17006000ZI0112,,,,,,,,,,,,,0,,,,,VI,vignes,,,1765,,
2023-213429,2023-12-13,000003,Echange,1059,,,LES PLANTES D ALLAS,B070,17500,17006,Allas-Champagne,17,,,17006000ZI0065,,,,,,,,,,,,,0,,,,,VI,vignes,,,1765,-0.321159,45.469633
2023-213448,2023-12-15,000001,Vente,19359,,,LES TARTARES,B084,17500,17006,Allas-Champagne,17,,,17006000ZI0102,,,,,,,,,,,,,0,,,,,T,terres,,,1233,-0.335319,45.472843
2023-213654,2023-12-22,000001,Vente,205000,19,,RTE DES VALLEES,0029,17500,17006,Allas-Champagne,17,,,17006000ZK0146,,,,,,,,,,,,,0,3,Dépendance,,0,J,jardins,,,2442,-0.332024,45.462198
2023-213654,2023-12-22,000001,Vente,205000,19,,RTE DES VALLEES,0029,17500,17006,Allas-Champagne,17,,,17006000ZK0146,,,,,,,,,,,,,0,1,Maison,88,4,S,sols,,,500,-0.332024,45.462198
2023-213654,2023-12-22,000001,Vente,205000,19,,RTE DES VALLEES,0029,17500,17006,Allas-Champagne,17,,,17006000ZK0146,,,,,,,,,,,,,0,3,Dépendance,,0,S,sols,,,500,-0.332024,45.462198
2023-213654,2023-12-22,000001,Vente,205000,19,,RTE DES VALLEES,0029,17500,17006,Allas-Champagne,17,,,17006000ZK0146,,,,,,,,,,,,,0,1,Maison,88,4,J,jardins,,,2442,-0.332024,45.462198
2023-213800,2023-12-19,000001,Vente,85000,13,,RTE DES VALLEES,0029,17500,17006,Allas-Champagne,17,,,17006000ZK0093,,,,,,,,,,,,,0,1,Maison,61,1,S,sols,,,699,-0.333961,45.461082
2023-213800,2023-12-19,000001,Vente,85000,13,,RTE DES VALLEES,0029,17500,17006,Allas-Champagne,17,,,17006000ZK0093,,,,,,,,,,,,,0,1,Maison,61,1,J,jardins,,,928,-0.333961,45.461082
