id_mutation,date_mutation,numero_disposition,nature_mutation,valeur_fonciere,adresse_numero,adresse_suffixe,adresse_nom_voie,adresse_code_voie,code_postal,code_commune,nom_commune,code_departement,ancien_code_commune,ancien_nom_commune,id_parcelle,ancien_id_parcelle,numero_volume,lot1_numero,lot1_surface_carrez,lot2_numero,lot2_surface_carrez,lot3_numero,lot3_surface_carrez,lot4_numero,lot4_surface_carrez,lot5_numero,lot5_surface_carrez,nombre_lots,code_type_local,type_local,surface_reelle_bati,nombre_pieces_principales,code_nature_culture,nature_culture,code_nature_culture_speciale,nature_culture_speciale,surface_terrain,longitude,latitude
2023-207642,2023-04-05,000001,Vente,190,,,GRAND POIGNARD,B082,17430,17085,Champdolent,17,,,17085000ZP0132,,,,,,,,,,,,,0,,,,,P,prés,,,2530,-0.82438,45.914583
2023-208140,2023-05-04,000001,Vente,150,,,LES BOUTINIERES,B036,17430,17085,Champdolent,17,,,17085000ZI0202,,,,,,,,,,,,,0,,,,,BT,taillis simples,,,697,-0.762578,45.905763
2023-208140,2023-05-04,000001,Vente,150,,,LES PALLEES,B099,17430,17085,Champdolent,17,,,17085000ZP0033,,,,,,,,,,,,,0,,,,,BT,taillis simples,,,550,-0.811047,45.912393
2023-208268,2023-05-11,000001,Vente,33750,,,LA POLTIERE,B112,17430,17085,Champdolent,17,,,17085000ZC0221,,,,,,,,,,,,,0,,,,,S,sols,,,273,-0.7672,45.918704
2023-208268,2023-05-11,000001,Vente,33750,,,LA POLTIERE,B112,17430,17085,Champdolent,17,,,17085000ZC0285,,,,,,,,,,,,,0,,,,,S,sols,,,609,-0.767173,45.918587
2023-208268,2023-05-11,000001,Vente,33750,,,LA POLTIERE,B112,17430,17085,Champdolent,17,,,17085000ZC0288,,,,,,,,,,,,,0,,,,,T,terres,,,91,-0.767181,45.918501
2023-209415,2023-06-20,000001,Vente,5000,,,L'AUDONNIERE,B003,17430,17085,Champdolent,17,,,17085000ZR0134,,,,,,,,,,,,,0,,,,,P,prés,,,1923,-0.793277,45.91813
2023-209458,2023-06-26,000001,Vente,3300,,,LE CHARPEAUX OUEST,B056,17430,17085,Champdolent,17,,,17085000ZS0119,,,,,,,,,,,,,0,,,,,P,prés,,,12630,-0.774738,45.920605
2023-210339,2023-07-19,000002,Vente,2000,,,CHAUDROY EST,B059,17430,17085,Champdolent,17,,,17085000ZC0281,,,,,,,,,,,,,0,,,,,S,sols,,,35,-0.768772,45.914878
2023-210919,2023-08-09,000001,Vente,235000,,,GRAND POIGNARD,B082,17430,17085,Champdolent,17,,,17085000ZP0166,,,,,,,,,,,,,0,,,,,BT,taillis simples,,,550,-0.819513,45.910481
2023-211338,2023-09-22,000001,Vente,266000,4,,RUE DES ROSES,0177,17430,17085,Champdolent,17,,,17085000ZE0251,,,,,,,,,,,,,0,,,,,AB,terrains a bâtir,,,1000,-0.752099,45.908604
2023-211338,2023-09-22,000001,Vente,266000,5,,RUE DES ROSES,0177,17430,17085,Champdolent,17,,,17085000ZE0252,,,,,,,,,,,,,0,3,Dépendance,,0,S,sols,,,1000,-0.752024,45.908813
2023-211338,2023-09-22,000001,Vente,266000,5,,RUE DES ROSES,0177,17430,17085,Champdolent,17,,,17085000ZE0252,,,,,,,,,,,,,0,1,Maison,132,4,S,sols,,,1000,-0.752024,45.908813
2023-211736,2023-10-02,000001,Vente,18000,,,CHAUDROY OUEST,B060,17430,17085,Champdolent,17,,,17085000ZS0054,,,,,,,,,,,,,0,,,,,P,prés,,,10000,-0.770214,45.915656
2023-211736,2023-10-02,000001,Vente,18000,,,CHAUDROY OUEST,B060,17430,17085,Champdolent,17,,,17085000ZS0054,,,,,,,,,,,,,0,,,,,BP,peupleraies,,,33188,-0.770214,45.915656
2023-211736,2023-10-02,000001,Vente,18000,,,CHAUDROY OUEST,B060,17430,17085,Champdolent,17,,,17085000ZS0120,,,,,,,,,,,,,0,,,,,S,sols,,,1440,-0.769314,45.915427
2023-212825,2023-11-22,000001,Vente,145000,7,,LA LANCE,B090,17430,17085,Champdolent,17,,,17085000ZC0224,,,,,,,,,,,,,0,1,Maison,160,5,S,sols,,,733,-0.758426,45.918773
2023-213263,2023-11-30,000001,Vente,303800,5204,,BEL-EBAT EST,B014,17430,17085,Champdolent,17,,,17085000ZS0132,,,,,,,,,,,,,0,3,Dépendance,,0,S,sols,,,1297,-0.791575,45.919873
2023-213263,2023-11-30,000001,Vente,303800,5204,,BEL-EBAT EST,B014,17430,17085,Champdolent,17,,,17085000ZS0132,,,,,,,,,,,,,0,1,Maison,118,4,S,sols,,,1297,-0.791575,45.919873
2023-213397,2023-12-14,000002,Vente,38000,,,LA VERGNE,B147,17430,17085,Champdolent,17,,,17085000ZC0270,,,,,,,,,,,,,0,,,,,T,terres,,,119,-0.76155,45.917277
2023-213397,2023-12-14,000002,Vente,38000,,,LA VERGNE,B147,17430,17085,Champdolent,17,,,17085000ZC0271,,,,,,,,,,,,,0,,,,,AB,terrains a bâtir,CHEM,Chemin (non groupe),447,-0.761494,45.9174
2023-213397,2023-12-14,000002,Vente,38000,,,LA VERGNE,B147,17430,17085,Champdolent,17,,,17085000ZC0275,,,,,,,,,,,,,0,,,,,AB,terrains a bâtir,CHEM,Chemin (non groupe),747,-0.762026,45.917452
2023-213397,2023-12-14,000002,Vente,38000,2,,LA VERGNE,B147,17430,17085,Champdolent,17,,,17085000ZC0295,,,,,,,,,,,,,0,1,Maison,72,2,S,sols,,,494,,
2023-213397,2023-12-14,000002,Vente,38000,2,,LA VERGNE,B147,17430,17085,Champdolent,17,,,17085000ZC0295,,,,,,,,,,,,,0,3,Dépendance,,0,S,sols,,,494,,
2023-213397,2023-12-14,000002,Vente,38000,2,,LA VERGNE,B147,17430,17085,Champdolent,17,,,17085000ZC0295,,,,,,,,,,,,,0,3,Dépendance,,0,S,sols,,,494,,
2023-213397,2023-12-14,000002,Vente,38000,2,,LA VERGNE,B147,17430,17085,Champdolent,17,,,17085000ZC0295,,,,,,,,,,,,,0,1,Maison,221,6,S,sols,,,494,,
2023-213397,2023-12-14,000002,Vente,38000,2,,LA VERGNE,B147,17430,17085,Champdolent,17,,,17085000ZC0295,,,,,,,,,,,,,0,3,Dépendance,,0,S,sols,,,494,,
